 




﻿"Item Id","Item URI","Dublin Core:Title","Dublin Core:Subject","Dublin Core:Description","Dublin Core:Creator","Dublin Core:Source","Dublin Core:Publisher","Dublin Core:Date","Dublin Core:Contributor","Dublin Core:Rights","Dublin Core:Relation","Dublin Core:Format","Dublin Core:Language","Dublin Core:Type","Dublin Core:Identifier","Dublin Core:Coverage","Item Type Metadata:Text","Item Type Metadata:Interviewer","Item Type Metadata:Interviewee","Item Type Metadata:Location","Item Type Metadata:Transcription","Item Type Metadata:Local URL","Item Type Metadata:Original Format","Item Type Metadata:Physical Dimensions","Item Type Metadata:Duration","Item Type Metadata:Compression","Item Type Metadata:Producer","Item Type Metadata:Director","Item Type Metadata:Bit Rate/Frequency","Item Type Metadata:Time Summary","Item Type Metadata:Email Body","Item Type Metadata:Subject Line","Item Type Metadata:From","Item Type Metadata:To","Item Type Metadata:CC","Item Type Metadata:BCC","Item Type Metadata:Number of Attachments","Item Type Metadata:Standards","Item Type Metadata:Objectives","Item Type Metadata:Materials","Item Type Metadata:Lesson Plan Text","Item Type Metadata:URL","Item Type Metadata:Event Type","Item Type Metadata:Participants","Item Type Metadata:Birth Date","Item Type Metadata:Birthplace","Item Type Metadata:Death Date","Item Type Metadata:Occupation","Item Type Metadata:Biographical Text","Item Type Metadata:Bibliography","Item Type Metadata:Digital Reproduction Information","Item Type Metadata:Repository","Item Type Metadata:Repository Collection","Item Type Metadata:Contact information.","Item Type Metadata:File Name","Item Type Metadata:Notes","Item Type Metadata:Digital item created","Item Type Metadata:Digital item modified","Item Type Metadata:Executive Orders","Item Type Metadata:Record Created","Item Type Metadata:Record Modified","Item Type Metadata:Transcription2","Item Type Metadata:Source URL","Omeka Legacy File:Additional Creator","Omeka Legacy File:Transcriber","Omeka Legacy File:Producer","Omeka Legacy File:Render Device","Omeka Legacy File:Render Details","Omeka Legacy File:Capture Date","Omeka Legacy File:Capture Device","Omeka Legacy File:Capture Details","Omeka Legacy File:Change History","Omeka Legacy File:Watermark","Omeka Legacy File:Encryption","Omeka Legacy File:Compression","Omeka Legacy File:Post Processing","Omeka Image File:Width","Omeka Image File:Height","Omeka Image File:Bit Depth","Omeka Image File:Channels","Omeka Image File:Exif String","Omeka Image File:Exif Array","Omeka Image File:IPTC String","Omeka Image File:IPTC Array","Omeka Video File:Bitrate","Omeka Video File:Duration","Omeka Video File:Sample Rate","Omeka Video File:Codec","Omeka Video File:Width","Omeka Video File:Height",tags,file,itemType,collection,public,featured
67439,https://www.iowaheritage.org/items/show/67439,"Theta Delta Chi Homecoming lawn display, """"Jayhawk,"""" 1950","Iowa State University|Homecoming|Lawn display","The Theta Delta Chi, Beta Deuteron Chapter, lawn display is located on the front lawn of their house.   The central figure of the display depicts the head, arms and torso of a muscular male.  The lower part of the figure tapers to a cyclone shape. On either side of this figure the word """"Jayhawk"""" is spelled out in separate letters.  The """"h"""" is laying horizontal to the ground.|Alumni first began returning to Iowa State for an official Homecoming in 1912. Since then, the celebration continues to entertain both young and old Iowa Staters, with traditional events, including tailgate parties, fireworks, lawn displays, """"Yell Like Hell"""" cheering competition, and mass campaniling. Currently, the Student Alumni Association Leadership Council coordinates the efforts of hundreds of students, who volunteer their time to help Story County Habitat for Humanity build a house.","Iowa State University",22-07-G.Homecoming.1651-1-2,"Iowa State University Library Special Collections: http://www.add.lib.iastate.edu/spcl/index.html",1950|2007-09,,"U.S. and international copyright laws protect this digital image. Commercial use or distribution of the image is not permitted without prior permission of the copyright holder. For permission to use the digital image, please contact Iowa State University Library, Special Collections archives@iastate.edu  For reproductions see:  http://www.add.lib.iastate.edu/spcl/services/photfees.html","University Photographs; http://www.add.lib.iastate.edu/spcl/collections/images.html","Photograph| 5.7 x 5.7 cm",,Image|Image,22-07-G.Homecoming.1651-1-2|https://digitalcollections.lib.iastate.edu/,,,,,,,,,,,,,,,,,,,,,,,,,,,,,,,,,,,,,,,,,,,,,,,,"<a href=""https://digitalcollections.lib.iastate.edu/"" target=""_blank"">View this item in its source respository</a>",,,,,,,,,,,,,,,,,,,,,,,,,,,,,https://www.iowaheritage.org/files/original/4b26102309743bb4d6be2c9da50da522.jpg,"Remote Item","Iowa State University Library Photograph Collection",1,0
72582,https://www.iowaheritage.org/items/show/72582,"Theta Delta Chi Homecoming lawn display, """"Jayhawk,"""" 1950","Iowa State University|Homecoming|Lawn display","The Theta Delta Chi, Beta Deuteron Chapter, lawn display is located on the front lawn of their house.   The central figure of the display depicts the head, arms and torso of a muscular male.  The lower part of the figure tapers to a cyclone shape. On either side of this figure the word """"Jayhawk"""" is spelled out in separate letters.  The """"h"""" is laying horizontal to the ground.|Alumni first began returning to Iowa State for an official Homecoming in 1912. Since then, the celebration continues to entertain both young and old Iowa Staters, with traditional events, including tailgate parties, fireworks, lawn displays, """"Yell Like Hell"""" cheering competition, and mass campaniling. Currently, the Student Alumni Association Leadership Council coordinates the efforts of hundreds of students, who volunteer their time to help Story County Habitat for Humanity build a house.","Iowa State University",22-07-G.Homecoming.1651-1-2,"Iowa State University Library Special Collections: http://www.add.lib.iastate.edu/spcl/index.html",1950|2007-09,,"U.S. and international copyright laws protect this digital image. Commercial use or distribution of the image is not permitted without prior permission of the copyright holder. For permission to use the digital image, please contact Iowa State University Library, Special Collections archives@iastate.edu  For reproductions see:  http://www.add.lib.iastate.edu/spcl/services/photfees.html","University Photographs; http://www.add.lib.iastate.edu/spcl/collections/images.html","Photograph| 5.7 x 5.7 cm",,Image|Image,22-07-G.Homecoming.1651-1-2|https://digitalcollections.lib.iastate.edu/,,,,,,,,,,,,,,,,,,,,,,,,,,,,,,,,,,,,,,,,,,,,,,,,"<a href=""https://digitalcollections.lib.iastate.edu/"" target=""_blank"">View this item in its source respository</a>",,,,,,,,,,,,,,,,,,,,,,,,,,,,,https://www.iowaheritage.org/files/original/a7e545cffd6eee0946c3b5b10e1ff27d.jpg,"Remote Item",,1,0
67526,https://www.iowaheritage.org/items/show/67526,"Theta Xi Homecoming lawn display, """"Iowa squeezes past Jayhawks,"""" 1962","Iowa State University|Homecoming|Lawn display","Cy, the ISU mascot is driving a steam roller over the tail of the Kansas University mascot, Jayhawk in this lawn display from Theta Xi, Mu Chapter.   A sign nearby partially reads, """"Iowa squeezes past Jayhawks 40-0."""" A group of men in suits are in the background looking at the display.|Alumni first began returning to Iowa State for an official Homecoming in 1912. Since then, the celebration continues to entertain both young and old Iowa Staters, with traditional events, including tailgate parties, fireworks, lawn displays, """"Yell Like Hell"""" cheering competition, and mass campaniling. Currently, the Student Alumni Association Leadership Council coordinates the efforts of hundreds of students, who volunteer their time to help Story County Habitat for Humanity build a house.","Iowa State University",22-07-G.Homecoming.1651-12-13,"Iowa State University Library Special Collections: http://www.add.lib.iastate.edu/spcl/index.html",1962|2007-09,,"U.S. and international copyright laws protect this digital image. Commercial use or distribution of the image is not permitted without prior permission of the copyright holder. For permission to use the digital image, please contact Iowa State University Library, Special Collections archives@iastate.edu  For reproductions see:  http://www.add.lib.iastate.edu/spcl/services/photfees.html","University Photographs; http://www.add.lib.iastate.edu/spcl/collections/images.html","Photograph| 11.4 x 7.6 cm",,Image|Image,22-07-G.Homecoming.1651-12-13|https://digitalcollections.lib.iastate.edu/,,,,,,,,,,,,,,,,,,,,,,,,,,,,,,,,,,,,,,,,,,,,,,,,"<a href=""https://digitalcollections.lib.iastate.edu/"" target=""_blank"">View this item in its source respository</a>",,,,,,,,,,,,,,,,,,,,,,,,,,,,,https://www.iowaheritage.org/files/original/c868dfc782dc48a809cd45ab9467d846.jpg,"Remote Item","Iowa State University Library Photograph Collection",1,0
72669,https://www.iowaheritage.org/items/show/72669,"Theta Xi Homecoming lawn display, """"Iowa squeezes past Jayhawks,"""" 1962","Iowa State University|Homecoming|Lawn display","Cy, the ISU mascot is driving a steam roller over the tail of the Kansas University mascot, Jayhawk in this lawn display from Theta Xi, Mu Chapter.   A sign nearby partially reads, """"Iowa squeezes past Jayhawks 40-0."""" A group of men in suits are in the background looking at the display.|Alumni first began returning to Iowa State for an official Homecoming in 1912. Since then, the celebration continues to entertain both young and old Iowa Staters, with traditional events, including tailgate parties, fireworks, lawn displays, """"Yell Like Hell"""" cheering competition, and mass campaniling. Currently, the Student Alumni Association Leadership Council coordinates the efforts of hundreds of students, who volunteer their time to help Story County Habitat for Humanity build a house.","Iowa State University",22-07-G.Homecoming.1651-12-13,"Iowa State University Library Special Collections: http://www.add.lib.iastate.edu/spcl/index.html",1962|2007-09,,"U.S. and international copyright laws protect this digital image. Commercial use or distribution of the image is not permitted without prior permission of the copyright holder. For permission to use the digital image, please contact Iowa State University Library, Special Collections archives@iastate.edu  For reproductions see:  http://www.add.lib.iastate.edu/spcl/services/photfees.html","University Photographs; http://www.add.lib.iastate.edu/spcl/collections/images.html","Photograph| 11.4 x 7.6 cm",,Image|Image,22-07-G.Homecoming.1651-12-13|https://digitalcollections.lib.iastate.edu/,,,,,,,,,,,,,,,,,,,,,,,,,,,,,,,,,,,,,,,,,,,,,,,,"<a href=""https://digitalcollections.lib.iastate.edu/"" target=""_blank"">View this item in its source respository</a>",,,,,,,,,,,,,,,,,,,,,,,,,,,,,https://www.iowaheritage.org/files/original/dbaf95266407858cd1454512acdf8b11.jpg,"Remote Item",,1,0
67445,https://www.iowaheritage.org/items/show/67445,"Theta Xi Homecoming lawn display, 1950","Iowa State University|Homecoming|Lawn display","Three individuals are working on the Theta Xi, Mu Chapter, homecoming lawn display of a man seated in an easy chair.  On the far side of a short hedge, another group of individuals are constructing a different display.|Alumni first began returning to Iowa State for an official Homecoming in 1912. Since then, the celebration continues to entertain both young and old Iowa Staters, with traditional events, including tailgate parties, fireworks, lawn displays, """"Yell Like Hell"""" cheering competition, and mass campaniling. Currently, the Student Alumni Association Leadership Council coordinates the efforts of hundreds of students, who volunteer their time to help Story County Habitat for Humanity build a house.","Iowa State University",22-07-G.Homecoming.1651-2-2,"Iowa State University Library Special Collections: http://www.add.lib.iastate.edu/spcl/index.html",1950|2007-09,,"U.S. and international copyright laws protect this digital image. Commercial use or distribution of the image is not permitted without prior permission of the copyright holder. For permission to use the digital image, please contact Iowa State University Library, Special Collections archives@iastate.edu  For reproductions see:  http://www.add.lib.iastate.edu/spcl/services/photfees.html","University Photographs; http://www.add.lib.iastate.edu/spcl/collections/images.html","Photograph| 5.4 x 5.4 cm",,Image|Image,22-07-G.Homecoming.1651-2-2|https://digitalcollections.lib.iastate.edu/,,,,,,,,,,,,,,,,,,,,,,,,,,,,,,,,,,,,,,,,,,,,,,,,"<a href=""https://digitalcollections.lib.iastate.edu/"" target=""_blank"">View this item in its source respository</a>",,,,,,,,,,,,,,,,,,,,,,,,,,,,,https://www.iowaheritage.org/files/original/990c65c1e7262ba9617f07d010295aef.jpg,"Remote Item","Iowa State University Library Photograph Collection",1,0
72588,https://www.iowaheritage.org/items/show/72588,"Theta Xi Homecoming lawn display, 1950","Iowa State University|Homecoming|Lawn display","Three individuals are working on the Theta Xi, Mu Chapter, homecoming lawn display of a man seated in an easy chair.  On the far side of a short hedge, another group of individuals are constructing a different display.|Alumni first began returning to Iowa State for an official Homecoming in 1912. Since then, the celebration continues to entertain both young and old Iowa Staters, with traditional events, including tailgate parties, fireworks, lawn displays, """"Yell Like Hell"""" cheering competition, and mass campaniling. Currently, the Student Alumni Association Leadership Council coordinates the efforts of hundreds of students, who volunteer their time to help Story County Habitat for Humanity build a house.","Iowa State University",22-07-G.Homecoming.1651-2-2,"Iowa State University Library Special Collections: http://www.add.lib.iastate.edu/spcl/index.html",1950|2007-09,,"U.S. and international copyright laws protect this digital image. Commercial use or distribution of the image is not permitted without prior permission of the copyright holder. For permission to use the digital image, please contact Iowa State University Library, Special Collections archives@iastate.edu  For reproductions see:  http://www.add.lib.iastate.edu/spcl/services/photfees.html","University Photographs; http://www.add.lib.iastate.edu/spcl/collections/images.html","Photograph| 5.4 x 5.4 cm",,Image|Image,22-07-G.Homecoming.1651-2-2|https://digitalcollections.lib.iastate.edu/,,,,,,,,,,,,,,,,,,,,,,,,,,,,,,,,,,,,,,,,,,,,,,,,"<a href=""https://digitalcollections.lib.iastate.edu/"" target=""_blank"">View this item in its source respository</a>",,,,,,,,,,,,,,,,,,,,,,,,,,,,,https://www.iowaheritage.org/files/original/037998d6310fb181768d2645a57071f3.jpg,"Remote Item",,1,0
67669,https://www.iowaheritage.org/items/show/67669,"Toss the J-Hawks Homecoming lawn display by Haber House and Lawther House, 1968","Iowa State University|Homecoming|Lawn Display","The Haber House and Lawther House Homecoming lawn display shows Cy wearing a chef's hat and tossing a salad to Toss the J-Hawks, outside the Linden Hall cafeteria, 1968.|Alumni first began returning to Iowa State for an official Homecoming in 1912. Since then, the celebration continues to entertain both young and old Iowa Staters, with traditional events, including tailgate parties, fireworks, lawn displays, """"Yell Like Hell"""" cheering competition, and mass campaniling. Currently, the Student Alumni Association Leadership Council coordinates the efforts of hundreds of students, who volunteer their time to help Story County Habitat for Humanity build a house.","Perry; Iowa State University",22-07-G.Homecoming.1666-05-03-11,"Iowa State University Library Special Collections: http://www.add.lib.iastate.edu/spcl/index.html",1968|2012-05,,"U.S. and international copyright laws protect this digital image. Commercial use or distribution of the image is not permitted without prior permission of the copyright holder. For permission to use the digital image, please contact Iowa State University Library, Special Collections archives@iastate.edu  For reproductions see:  http://www.add.lib.iastate.edu/spcl/services/photfees.html","University Photographs; http://www.add.lib.iastate.edu/spcl/collections/images.html","Photograph| 5.7 x 5.8 cm",,Image|Image,22-07-G.Homecoming.1666-05-03-11|https://digitalcollections.lib.iastate.edu/,,,,,,,,,,,,,,,,,,,,,,,,,,,,,,,,,,,,,,,,,,,,,,,,"<a href=""https://digitalcollections.lib.iastate.edu/"" target=""_blank"">View this item in its source respository</a>",,,,,,,,,,,,,,,,,,,,,,,,,,,,,https://www.iowaheritage.org/files/original/c001f35f5f873e72d49ddc44a2afdc08.jpg,"Remote Item","Iowa State University Library Photograph Collection",1,0
72812,https://www.iowaheritage.org/items/show/72812,"Toss the J-Hawks Homecoming lawn display by Haber House and Lawther House, 1968","Iowa State University|Homecoming|Lawn Display","The Haber House and Lawther House Homecoming lawn display shows Cy wearing a chef's hat and tossing a salad to Toss the J-Hawks, outside the Linden Hall cafeteria, 1968.|Alumni first began returning to Iowa State for an official Homecoming in 1912. Since then, the celebration continues to entertain both young and old Iowa Staters, with traditional events, including tailgate parties, fireworks, lawn displays, """"Yell Like Hell"""" cheering competition, and mass campaniling. Currently, the Student Alumni Association Leadership Council coordinates the efforts of hundreds of students, who volunteer their time to help Story County Habitat for Humanity build a house.","Perry; Iowa State University",22-07-G.Homecoming.1666-05-03-11,"Iowa State University Library Special Collections: http://www.add.lib.iastate.edu/spcl/index.html",1968|2012-05,,"U.S. and international copyright laws protect this digital image. Commercial use or distribution of the image is not permitted without prior permission of the copyright holder. For permission to use the digital image, please contact Iowa State University Library, Special Collections archives@iastate.edu  For reproductions see:  http://www.add.lib.iastate.edu/spcl/services/photfees.html","University Photographs; http://www.add.lib.iastate.edu/spcl/collections/images.html","Photograph| 5.7 x 5.8 cm",,Image|Image,22-07-G.Homecoming.1666-05-03-11|https://digitalcollections.lib.iastate.edu/,,,,,,,,,,,,,,,,,,,,,,,,,,,,,,,,,,,,,,,,,,,,,,,,"<a href=""https://digitalcollections.lib.iastate.edu/"" target=""_blank"">View this item in its source respository</a>",,,,,,,,,,,,,,,,,,,,,,,,,,,,,https://www.iowaheritage.org/files/original/c38647a2c4d8e1b1592cc79cb31d66e0.jpg,"Remote Item",,1,0
67556,https://www.iowaheritage.org/items/show/67556,"Two girls are posed in front of a covered wagon lawn display at Homecoming, 1946","Iowa State University|Homecoming|Lawn display","Two girls are posed in front of a lawn display depicting a horse-drawn covered wagon that has the words """"Sooners"""" on the side. Two  cardboard ISC football players are at the top of the photograph.|Alumni first began returning to Iowa State for an official Homecoming in 1912. Since then, the celebration continues to entertain both young and old Iowa Staters, with traditional events, including tailgate parties, fireworks, lawn displays, """"Yell Like Hell"""" cheering competition, and mass campaniling. Currently, the Student Alumni Association Leadership Council coordinates the efforts of hundreds of students, who volunteer their time to help Story County Habitat for Humanity build a house.","Iowa State University",22-07-G.Homecoming.1662-1-7,"Iowa State University Library Special Collections: http://www.add.lib.iastate.edu/spcl/index.html",1946|2007-10,,"U.S. and international copyright laws protect this digital image. Commercial use or distribution of the image is not permitted without prior permission of the copyright holder. For permission to use the digital image, please contact Iowa State University Library, Special Collections archives@iastate.edu  For reproductions see:  http://www.add.lib.iastate.edu/spcl/services/photfees.html","University Photographs; http://www.add.lib.iastate.edu/spcl/collections/images.html","Photograph| 19.4 x 24.1 cm",,Image|Image,22-07-G.Homecoming.1662-1-7|https://digitalcollections.lib.iastate.edu/,,,,,,,,,,,,,,,,,,,,,,,,,,,,,,,,,,,,,,,,,,,,,,,,"<a href=""https://digitalcollections.lib.iastate.edu/"" target=""_blank"">View this item in its source respository</a>",,,,,,,,,,,,,,,,,,,,,,,,,,,,,https://www.iowaheritage.org/files/original/5b66ef18ce30cef67a66cc77978210f9.jpg,"Remote Item","Iowa State University Library Photograph Collection",1,0
72699,https://www.iowaheritage.org/items/show/72699,"Two girls are posed in front of a covered wagon lawn display at Homecoming, 1946","Iowa State University|Homecoming|Lawn display","Two girls are posed in front of a lawn display depicting a horse-drawn covered wagon that has the words """"Sooners"""" on the side. Two  cardboard ISC football players are at the top of the photograph.|Alumni first began returning to Iowa State for an official Homecoming in 1912. Since then, the celebration continues to entertain both young and old Iowa Staters, with traditional events, including tailgate parties, fireworks, lawn displays, """"Yell Like Hell"""" cheering competition, and mass campaniling. Currently, the Student Alumni Association Leadership Council coordinates the efforts of hundreds of students, who volunteer their time to help Story County Habitat for Humanity build a house.","Iowa State University",22-07-G.Homecoming.1662-1-7,"Iowa State University Library Special Collections: http://www.add.lib.iastate.edu/spcl/index.html",1946|2007-10,,"U.S. and international copyright laws protect this digital image. Commercial use or distribution of the image is not permitted without prior permission of the copyright holder. For permission to use the digital image, please contact Iowa State University Library, Special Collections archives@iastate.edu  For reproductions see:  http://www.add.lib.iastate.edu/spcl/services/photfees.html","University Photographs; http://www.add.lib.iastate.edu/spcl/collections/images.html","Photograph| 19.4 x 24.1 cm",,Image|Image,22-07-G.Homecoming.1662-1-7|https://digitalcollections.lib.iastate.edu/,,,,,,,,,,,,,,,,,,,,,,,,,,,,,,,,,,,,,,,,,,,,,,,,"<a href=""https://digitalcollections.lib.iastate.edu/"" target=""_blank"">View this item in its source respository</a>",,,,,,,,,,,,,,,,,,,,,,,,,,,,,https://www.iowaheritage.org/files/original/68124c46129db9870696f6bb249973b3.jpg,"Remote Item",,1,0
