 




﻿"Item Id","Item URI","Dublin Core:Title","Dublin Core:Subject","Dublin Core:Description","Dublin Core:Creator","Dublin Core:Source","Dublin Core:Publisher","Dublin Core:Date","Dublin Core:Contributor","Dublin Core:Rights","Dublin Core:Relation","Dublin Core:Format","Dublin Core:Language","Dublin Core:Type","Dublin Core:Identifier","Dublin Core:Coverage","Item Type Metadata:Text","Item Type Metadata:Interviewer","Item Type Metadata:Interviewee","Item Type Metadata:Location","Item Type Metadata:Transcription","Item Type Metadata:Local URL","Item Type Metadata:Original Format","Item Type Metadata:Physical Dimensions","Item Type Metadata:Duration","Item Type Metadata:Compression","Item Type Metadata:Producer","Item Type Metadata:Director","Item Type Metadata:Bit Rate/Frequency","Item Type Metadata:Time Summary","Item Type Metadata:Email Body","Item Type Metadata:Subject Line","Item Type Metadata:From","Item Type Metadata:To","Item Type Metadata:CC","Item Type Metadata:BCC","Item Type Metadata:Number of Attachments","Item Type Metadata:Standards","Item Type Metadata:Objectives","Item Type Metadata:Materials","Item Type Metadata:Lesson Plan Text","Item Type Metadata:URL","Item Type Metadata:Event Type","Item Type Metadata:Participants","Item Type Metadata:Birth Date","Item Type Metadata:Birthplace","Item Type Metadata:Death Date","Item Type Metadata:Occupation","Item Type Metadata:Biographical Text","Item Type Metadata:Bibliography","Item Type Metadata:Digital Reproduction Information","Item Type Metadata:Repository","Item Type Metadata:Repository Collection","Item Type Metadata:Contact information.","Item Type Metadata:File Name","Item Type Metadata:Notes","Item Type Metadata:Digital item created","Item Type Metadata:Digital item modified","Item Type Metadata:Executive Orders","Item Type Metadata:Record Created","Item Type Metadata:Record Modified","Item Type Metadata:Transcription2","Item Type Metadata:Source URL","Omeka Legacy File:Additional Creator","Omeka Legacy File:Transcriber","Omeka Legacy File:Producer","Omeka Legacy File:Render Device","Omeka Legacy File:Render Details","Omeka Legacy File:Capture Date","Omeka Legacy File:Capture Device","Omeka Legacy File:Capture Details","Omeka Legacy File:Change History","Omeka Legacy File:Watermark","Omeka Legacy File:Encryption","Omeka Legacy File:Compression","Omeka Legacy File:Post Processing","Omeka Image File:Width","Omeka Image File:Height","Omeka Image File:Bit Depth","Omeka Image File:Channels","Omeka Image File:Exif String","Omeka Image File:Exif Array","Omeka Image File:IPTC String","Omeka Image File:IPTC Array","Omeka Video File:Bitrate","Omeka Video File:Duration","Omeka Video File:Sample Rate","Omeka Video File:Codec","Omeka Video File:Width","Omeka Video File:Height",tags,file,itemType,collection,public,featured
67646,https://www.iowaheritage.org/items/show/67646,"Adele Berry, Homecoming Queen, 1965","Iowa State University|Homecoming|Homecoming Queen","Adele Berry, Homecoming Queen, is shown wearing her crown in this portrait, 1965.|Alumni first began returning to Iowa State for an official Homecoming in 1912. Since then, the celebration continues to entertain both young and old Iowa Staters, with traditional events, including tailgate parties, fireworks, lawn displays, """"Yell Like Hell"""" cheering competition, and mass campaniling. Currently, the Student Alumni Association Leadership Council coordinates the efforts of hundreds of students, who volunteer their time to help Story County Habitat for Humanity build a house.","Elder; Iowa State University",22-07-G.Homecoming.1665-07-01-1,"Iowa State University Library Special Collections: http://www.add.lib.iastate.edu/spcl/index.html",1965|2012-04,,"U.S. and international copyright laws protect this digital image. Commercial use or distribution of the image is not permitted without prior permission of the copyright holder. For permission to use the digital image, please contact Iowa State University Library, Special Collections archives@iastate.edu  For reproductions see:  http://www.add.lib.iastate.edu/spcl/services/photfees.html","University Photographs; http://www.add.lib.iastate.edu/spcl/collections/images.html","Photograph| 9.6 x 11.8 cm",,Image|Image,22-07-G.Homecoming.1665-07-01-1|https://digitalcollections.lib.iastate.edu/,,,,,,,,,,,,,,,,,,,,,,,,,,,,,,,,,,,,,,,,,,,,,,,,"<a href=""https://digitalcollections.lib.iastate.edu/"" target=""_blank"">View this item in its source respository</a>",,,,,,,,,,,,,,,,,,,,,,,,,,,,,https://www.iowaheritage.org/files/original/b1a37419867dc8b57f37015858d3bf05.jpg,"Remote Item","Iowa State University Library Photograph Collection",1,0
72789,https://www.iowaheritage.org/items/show/72789,"Adele Berry, Homecoming Queen, 1965","Iowa State University|Homecoming|Homecoming Queen","Adele Berry, Homecoming Queen, is shown wearing her crown in this portrait, 1965.|Alumni first began returning to Iowa State for an official Homecoming in 1912. Since then, the celebration continues to entertain both young and old Iowa Staters, with traditional events, including tailgate parties, fireworks, lawn displays, """"Yell Like Hell"""" cheering competition, and mass campaniling. Currently, the Student Alumni Association Leadership Council coordinates the efforts of hundreds of students, who volunteer their time to help Story County Habitat for Humanity build a house.","Elder; Iowa State University",22-07-G.Homecoming.1665-07-01-1,"Iowa State University Library Special Collections: http://www.add.lib.iastate.edu/spcl/index.html",1965|2012-04,,"U.S. and international copyright laws protect this digital image. Commercial use or distribution of the image is not permitted without prior permission of the copyright holder. For permission to use the digital image, please contact Iowa State University Library, Special Collections archives@iastate.edu  For reproductions see:  http://www.add.lib.iastate.edu/spcl/services/photfees.html","University Photographs; http://www.add.lib.iastate.edu/spcl/collections/images.html","Photograph| 9.6 x 11.8 cm",,Image|Image,22-07-G.Homecoming.1665-07-01-1|https://digitalcollections.lib.iastate.edu/,,,,,,,,,,,,,,,,,,,,,,,,,,,,,,,,,,,,,,,,,,,,,,,,"<a href=""https://digitalcollections.lib.iastate.edu/"" target=""_blank"">View this item in its source respository</a>",,,,,,,,,,,,,,,,,,,,,,,,,,,,,https://www.iowaheritage.org/files/original/da58b62bd149e3057ad6fe6c996c66c4.jpg,"Remote Item",,1,0
68930,https://www.iowaheritage.org/items/show/68930,"Aerial view of 1st library addition excavation, 1960","Iowa State University|University Library","This aerial view shows the excavation site for the 1st addition to the library. A war surplus building, Number """"N"""" appears on the far left.  It was taken down in 1968 prior to construction of the 2nd addition.|The library was first housed in Old Main, which also contained the college's reception room, lecture hall, specimen museum, students' rooms, a chapel, kitchen, laundry, and dining room. An initial purchase of $2,500 for books for the library was made in 1870 by President Welch. The library was moved to Morrill Hall in 1896 and to the Central Building (now Beardshear Hall) in 1913. In 1925, the new library building was completed to house the library's 115,000 volumes under one roof. The new facility was not large enough to allow for adequate expansion and was outgrown within five years. The first addition to the library was completed in 1961, with a second addition completed in 1969 and a third addition was completed in 1983. In 1984, the Iowa State University Library was officially dedicated as the W. Robert and Ellen Sorge Parks Library.","Iowa State University",RS-4-8-I.Library.258-04-03-08,"Iowa State University Library Special Collections: http://www.add.lib.iastate.edu/spcl/index.html",1960-07-12|2008-03,,"U.S. and international copyright laws protect this digital image. Commercial use or distribution of the image is not permitted without prior permission of the copyright holder. For permission to use the digital image, please contact Iowa State University Library, Special Collections archives@iastate.edu  For reproductions see:  http://www.add.lib.iastate.edu/spcl/services/photfees.html","University Photographs; http://www.add.lib.iastate.edu/spcl/collections/images.html",Photograph,,Image|Image,RS-4-8-I.Library.258-04-03-08|https://digitalcollections.lib.iastate.edu/,,,,,,,,,,,,,,,,,,,,,,,,,,,,,,,,,,,,,,,,,,,,,,,,"<a href=""https://digitalcollections.lib.iastate.edu/"" target=""_blank"">View this item in its source respository</a>",,,,,,,,,,,,,,,,,,,,,,,,,,,,,https://www.iowaheritage.org/files/original/1cdfed2e60894cdede108c7bde6bdeb6.jpg,"Remote Item","Iowa State University Library Photograph Collection",1,0
73424,https://www.iowaheritage.org/items/show/73424,"Aerial view of 1st library addition excavation, 1960","Iowa State University|University Library","This aerial view shows the excavation site for the 1st addition to the library. A war surplus building, Number """"N"""" appears on the far left.  It was taken down in 1968 prior to construction of the 2nd addition.|The library was first housed in Old Main, which also contained the college's reception room, lecture hall, specimen museum, students' rooms, a chapel, kitchen, laundry, and dining room. An initial purchase of $2,500 for books for the library was made in 1870 by President Welch. The library was moved to Morrill Hall in 1896 and to the Central Building (now Beardshear Hall) in 1913. In 1925, the new library building was completed to house the library's 115,000 volumes under one roof. The new facility was not large enough to allow for adequate expansion and was outgrown within five years. The first addition to the library was completed in 1961, with a second addition completed in 1969 and a third addition was completed in 1983. In 1984, the Iowa State University Library was officially dedicated as the W. Robert and Ellen Sorge Parks Library.","Iowa State University",RS-4-8-I.Library.258-04-03-08,"Iowa State University Library Special Collections: http://www.add.lib.iastate.edu/spcl/index.html",1960-07-12|2008-03,,"U.S. and international copyright laws protect this digital image. Commercial use or distribution of the image is not permitted without prior permission of the copyright holder. For permission to use the digital image, please contact Iowa State University Library, Special Collections archives@iastate.edu  For reproductions see:  http://www.add.lib.iastate.edu/spcl/services/photfees.html","University Photographs; http://www.add.lib.iastate.edu/spcl/collections/images.html",Photograph,,Image|Image,RS-4-8-I.Library.258-04-03-08|https://digitalcollections.lib.iastate.edu/,,,,,,,,,,,,,,,,,,,,,,,,,,,,,,,,,,,,,,,,,,,,,,,,"<a href=""https://digitalcollections.lib.iastate.edu/"" target=""_blank"">View this item in its source respository</a>",,,,,,,,,,,,,,,,,,,,,,,,,,,,,https://www.iowaheritage.org/files/original/dca9580def05461d88113310e74d92df.jpg,"Remote Item",,1,0
69118,https://www.iowaheritage.org/items/show/69118,"Aerial view of Curtiss Hall soon after completion, and buildings to its east.","Iowa State University|Curtiss Hall","An aerial view of newly completed Agriculture Hall (Curtiss Hall), possibly from the Campanile, shows some of the buildings to its east.  These include the Dairy Building (East Hall after 1928) and the roofs of the Horse Barn (Landscape Architecture after 1930), the twin Stock Judging Pavilions, and the Power and Heating Plant.|Designed by the architectural firm of Proudfoot and Bird, Agriculture Hall, as Curtiss Hall was first called, was built in 1906-1909. The building was originally planned to be built 100 feet west of its current location, but the plans were changed after opposition to placing a building in the center of the beautiful campus lawn was voiced. Work on the building ceased in 1907 when the contractor declared bankruptcy. Work soon resumed under the direction of a bonding company. Although the building was completed in 1909, it stood unoccupied until 1912 when the accounts were finally settled with the surety company. Agriculture Hall was officially renamed Curtiss Hall in 1947 for Charles F. Curtiss, long-time Dean of Agriculture (1902-1932) at Iowa State. In 1995, an agricultural high-tech classroom was built within the building, called the Brenton Center for Agricultural Instruction and Technology Transfer.Curtiss Hall (originally Agriculture Hall) was built in 1906-1908, by the architect Proudfoot and Bird. The building was renamed Curtiss Hall still hosts the College of Agriculture and Life Sciences, whose mission is to “enrich the lives of people in Iowa, the nation and the world through excellence in education, scholarship, service and leadership in food, agricultural, environmental and social sciences.”","Iowa State University",4-8-I.Curtiss.246-6-2,"Iowa State University Library Special Collections; http://www.add.lib.iastate.edu/spcl/index.html",1909?|2006-05-19,,"U.S. and international copyright laws protect this digital image. Commercial use or distribution of the image is not permitted without prior permission of the copyright holder. For permission to use the digital image, please contact Iowa State University Library, Special Collections archives@iastate.edu  For reproductions see:  http://www.add.lib.iastate.edu/spcl/services/photfees.html","University Photographs; http://www.add.lib.iastate.edu/spcl/collections/images.html","Photograph| 23.5 x 18.4 cm",,"Image (color)|Image",4-8-I.Curtiss.246-6-2|https://digitalcollections.lib.iastate.edu/,,,,,,,,,,,,,,,,,,,,,,,,,,,,,,,,,,,,,,,,,,,,,,,,"<a href=""https://digitalcollections.lib.iastate.edu/"" target=""_blank"">View this item in its source respository</a>",,,,,,,,,,,,,,,,,,,,,,,,,,,,,https://www.iowaheritage.org/files/original/da939368dbc28f04e4070b099627410d.jpg,"Remote Item","Iowa State University Library Photograph Collection",1,0
73612,https://www.iowaheritage.org/items/show/73612,"Aerial view of Curtiss Hall soon after completion, and buildings to its east.","Iowa State University|Curtiss Hall","An aerial view of newly completed Agriculture Hall (Curtiss Hall), possibly from the Campanile, shows some of the buildings to its east.  These include the Dairy Building (East Hall after 1928) and the roofs of the Horse Barn (Landscape Architecture after 1930), the twin Stock Judging Pavilions, and the Power and Heating Plant.|Designed by the architectural firm of Proudfoot and Bird, Agriculture Hall, as Curtiss Hall was first called, was built in 1906-1909. The building was originally planned to be built 100 feet west of its current location, but the plans were changed after opposition to placing a building in the center of the beautiful campus lawn was voiced. Work on the building ceased in 1907 when the contractor declared bankruptcy. Work soon resumed under the direction of a bonding company. Although the building was completed in 1909, it stood unoccupied until 1912 when the accounts were finally settled with the surety company. Agriculture Hall was officially renamed Curtiss Hall in 1947 for Charles F. Curtiss, long-time Dean of Agriculture (1902-1932) at Iowa State. In 1995, an agricultural high-tech classroom was built within the building, called the Brenton Center for Agricultural Instruction and Technology Transfer.Curtiss Hall (originally Agriculture Hall) was built in 1906-1908, by the architect Proudfoot and Bird. The building was renamed Curtiss Hall still hosts the College of Agriculture and Life Sciences, whose mission is to “enrich the lives of people in Iowa, the nation and the world through excellence in education, scholarship, service and leadership in food, agricultural, environmental and social sciences.”","Iowa State University",4-8-I.Curtiss.246-6-2,"Iowa State University Library Special Collections; http://www.add.lib.iastate.edu/spcl/index.html",1909?|2006-05-19,,"U.S. and international copyright laws protect this digital image. Commercial use or distribution of the image is not permitted without prior permission of the copyright holder. For permission to use the digital image, please contact Iowa State University Library, Special Collections archives@iastate.edu  For reproductions see:  http://www.add.lib.iastate.edu/spcl/services/photfees.html","University Photographs; http://www.add.lib.iastate.edu/spcl/collections/images.html","Photograph| 23.5 x 18.4 cm",,"Image (color)|Image",4-8-I.Curtiss.246-6-2|https://digitalcollections.lib.iastate.edu/,,,,,,,,,,,,,,,,,,,,,,,,,,,,,,,,,,,,,,,,,,,,,,,,"<a href=""https://digitalcollections.lib.iastate.edu/"" target=""_blank"">View this item in its source respository</a>",,,,,,,,,,,,,,,,,,,,,,,,,,,,,https://www.iowaheritage.org/files/original/6ef9c3c27ce97132355898b939344462.jpg,"Remote Item",,1,0
69223,https://www.iowaheritage.org/items/show/69223,"Aerial view of the front of the State Gymnasium","Iowa State University|State Gymnasium|Machine Shop|Clyde Williams Field","This aerial view of the State Gymnasium is labeled """"in front of Mens Gymnasium, Iowa State College."""" Part of the track and stadium is visible in back, and athletic courts are in use by people across the road in front.  Cars from the 1920s or 1930s line the road in front.  The Machine Shop is visible on the left, and neighborhood buildings are visible across Sheldon Avenue on the right.|State Gymnasium was constructed from 1911-1913 and originally included a swimming pool, handball courts, and a running track. During the years 1918 and 1919, the gym became a dining hall for army recruits on campus. The exterior stairs at the center of the north side were added in 1936 and include Christian Petersen sculpture panels.  A fire in 1962 caused some damage and loss of equipment. The gymnasium was renovated in 1967, which included a new track and other improvements. From 2009-2012 State Gym underwent a complete renovation project and a large addition was built on the west side including a new pool, basketball courts and running track as well as a skywalk over Union Drive connecting it to Beyer Hall.","Iowa State University",04-08-I-StateGym-213-11-005,"Iowa State University Library Special Collections: http://www.add.lib.iastate.edu/spcl/index.html",1930s?|2013-04,,"U.S. and international copyright laws protect this digital image. Commercial use or distribution of the image is not permitted without prior permission of the copyright holder. For permission to use the digital image, please contact Iowa State University Library, Special Collections archives@iastate.edu  For reproductions see:  http://www.add.lib.iastate.edu/spcl/services/photfees.html","University Photographs; http://www.add.lib.iastate.edu/spcl/collections/images.html",Photograph,,Image|Image,04-08-I-StateGym-213-11-005|https://digitalcollections.lib.iastate.edu/,,,,,,,,,,,,,,,,,,,,,,,,,,,,,,,,,,,,,,,,,,,,,,,,"<a href=""https://digitalcollections.lib.iastate.edu/"" target=""_blank"">View this item in its source respository</a>",,,,,,,,,,,,,,,,,,,,,,,,,,,,,https://www.iowaheritage.org/files/original/c6205f721f16d102a658b9e7a2b53465.jpg,"Remote Item","Iowa State University Library Photograph Collection",1,0
73717,https://www.iowaheritage.org/items/show/73717,"Aerial view of the front of the State Gymnasium","Iowa State University|State Gymnasium|Machine Shop|Clyde Williams Field","This aerial view of the State Gymnasium is labeled """"in front of Mens Gymnasium, Iowa State College."""" Part of the track and stadium is visible in back, and athletic courts are in use by people across the road in front.  Cars from the 1920s or 1930s line the road in front.  The Machine Shop is visible on the left, and neighborhood buildings are visible across Sheldon Avenue on the right.|State Gymnasium was constructed from 1911-1913 and originally included a swimming pool, handball courts, and a running track. During the years 1918 and 1919, the gym became a dining hall for army recruits on campus. The exterior stairs at the center of the north side were added in 1936 and include Christian Petersen sculpture panels.  A fire in 1962 caused some damage and loss of equipment. The gymnasium was renovated in 1967, which included a new track and other improvements. From 2009-2012 State Gym underwent a complete renovation project and a large addition was built on the west side including a new pool, basketball courts and running track as well as a skywalk over Union Drive connecting it to Beyer Hall.","Iowa State University",04-08-I-StateGym-213-11-005,"Iowa State University Library Special Collections: http://www.add.lib.iastate.edu/spcl/index.html",1930s?|2013-04,,"U.S. and international copyright laws protect this digital image. Commercial use or distribution of the image is not permitted without prior permission of the copyright holder. For permission to use the digital image, please contact Iowa State University Library, Special Collections archives@iastate.edu  For reproductions see:  http://www.add.lib.iastate.edu/spcl/services/photfees.html","University Photographs; http://www.add.lib.iastate.edu/spcl/collections/images.html",Photograph,,Image|Image,04-08-I-StateGym-213-11-005|https://digitalcollections.lib.iastate.edu/,,,,,,,,,,,,,,,,,,,,,,,,,,,,,,,,,,,,,,,,,,,,,,,,"<a href=""https://digitalcollections.lib.iastate.edu/"" target=""_blank"">View this item in its source respository</a>",,,,,,,,,,,,,,,,,,,,,,,,,,,,,https://www.iowaheritage.org/files/original/9f0f2a837614334c5c0a7c57849f74af.jpg,"Remote Item",,1,0
67861,https://www.iowaheritage.org/items/show/67861,"Aerial view of various farm buildings and facilities, 1960","Iowa State University|Iowa Agriculture and Home Economics Experiment Station","An aerial view of various farm buildings and facilities includes buildings, roads, fields and a parking lot.|The Agricultural Experiment Station began at the Iowa Agricultural College and Model Farm (now Iowa State University) as a result of the Hatch Act of 1887 and an act passed by the Iowa General Assembly in 1888. The purpose of the station is to conduct research relating to agriculture and associated disciplines and to disseminate that information.  The name of the station was changed in in 1957 to Agricultural and Home Economics Experiment Station and again in 1966 to Agriculture and Home Economics Experiment Station.","Iowa State University",09-02-K.IAHEES.534-02-01,"Iowa State University Library Special Collections: http://www.add.lib.iastate.edu/spcl/index.html",1960-12-27|2012-06,,"U.S. and international copyright laws protect this digital image. Commercial use or distribution of the image is not permitted without prior permission of the copyright holder. For permission to use the digital image, please contact Iowa State University Library, Special Collections archives@iastate.edu  For reproductions see:  http://www.add.lib.iastate.edu/spcl/services/photfees.html","University Photographs; http://www.add.lib.iastate.edu/spcl/collections/images.html","Photograph| 11.5 x 8.7 cm",,Image|Image,09-02-K.IAHEES.534-02-01|https://digitalcollections.lib.iastate.edu/,,,,,,,,,,,,,,,,,,,,,,,,,,,,,,,,,,,,,,,,,,,,,,,,"<a href=""https://digitalcollections.lib.iastate.edu/"" target=""_blank"">View this item in its source respository</a>",,,,,,,,,,,,,,,,,,,,,,,,,,,,,https://www.iowaheritage.org/files/original/498d9f53207887212b9717790de7717c.jpg,"Remote Item","Iowa State University Library Photograph Collection",1,0