 




﻿"Item Id","Item URI","Dublin Core:Title","Dublin Core:Subject","Dublin Core:Description","Dublin Core:Creator","Dublin Core:Source","Dublin Core:Publisher","Dublin Core:Date","Dublin Core:Contributor","Dublin Core:Rights","Dublin Core:Relation","Dublin Core:Format","Dublin Core:Language","Dublin Core:Type","Dublin Core:Identifier","Dublin Core:Coverage","Item Type Metadata:Text","Item Type Metadata:Interviewer","Item Type Metadata:Interviewee","Item Type Metadata:Location","Item Type Metadata:Transcription","Item Type Metadata:Local URL","Item Type Metadata:Original Format","Item Type Metadata:Physical Dimensions","Item Type Metadata:Duration","Item Type Metadata:Compression","Item Type Metadata:Producer","Item Type Metadata:Director","Item Type Metadata:Bit Rate/Frequency","Item Type Metadata:Time Summary","Item Type Metadata:Email Body","Item Type Metadata:Subject Line","Item Type Metadata:From","Item Type Metadata:To","Item Type Metadata:CC","Item Type Metadata:BCC","Item Type Metadata:Number of Attachments","Item Type Metadata:Standards","Item Type Metadata:Objectives","Item Type Metadata:Materials","Item Type Metadata:Lesson Plan Text","Item Type Metadata:URL","Item Type Metadata:Event Type","Item Type Metadata:Participants","Item Type Metadata:Birth Date","Item Type Metadata:Birthplace","Item Type Metadata:Death Date","Item Type Metadata:Occupation","Item Type Metadata:Biographical Text","Item Type Metadata:Bibliography","Item Type Metadata:Digital Reproduction Information","Item Type Metadata:Repository","Item Type Metadata:Repository Collection","Item Type Metadata:Contact information.","Item Type Metadata:File Name","Item Type Metadata:Notes","Item Type Metadata:Digital item created","Item Type Metadata:Digital item modified","Item Type Metadata:Executive Orders","Item Type Metadata:Record Created","Item Type Metadata:Record Modified","Item Type Metadata:Transcription2","Item Type Metadata:Source URL","Omeka Legacy File:Additional Creator","Omeka Legacy File:Transcriber","Omeka Legacy File:Producer","Omeka Legacy File:Render Device","Omeka Legacy File:Render Details","Omeka Legacy File:Capture Date","Omeka Legacy File:Capture Device","Omeka Legacy File:Capture Details","Omeka Legacy File:Change History","Omeka Legacy File:Watermark","Omeka Legacy File:Encryption","Omeka Legacy File:Compression","Omeka Legacy File:Post Processing","Omeka Image File:Width","Omeka Image File:Height","Omeka Image File:Bit Depth","Omeka Image File:Channels","Omeka Image File:Exif String","Omeka Image File:Exif Array","Omeka Image File:IPTC String","Omeka Image File:IPTC Array","Omeka Video File:Bitrate","Omeka Video File:Duration","Omeka Video File:Sample Rate","Omeka Video File:Codec","Omeka Video File:Width","Omeka Video File:Height",tags,file,itemType,collection,public,featured
65963,https://www.iowaheritage.org/items/show/65963,"Monroe County History, Iowa","Monroe County (Iowa)|History","Compiled and written by the Iowa Writers' program of the Work Projects Administration for the state of Iowa. Sponsored by county superintendent of schools, Monroe county.","Iowa Writers' Program of the Works Projects Administration in the State of Iowa","F627 M75w","Iowa State University Library http://www.lib.iastate.edu",1940|2003-07,,"U.S. and international copyright laws protect this digital image. Commercial use or distribution of the image is not permitted without prior permission of the copyright holder.",,"92 pages; 28 cm|Monograph|PDF",,"Text; Image",F627.M75w|https://digitalcollections.lib.iastate.edu/,,,,,,,,,,,,,,,,,,,,,,,,,,,,,,,,,,,,,,,,,,,,,,,,"<a href=""https://digitalcollections.lib.iastate.edu/"" target=""_blank"">View this item in its source respository</a>",,,,,,,,,,,,,,,,,,,,,,,,,,,,,https://www.iowaheritage.org/files/original/a4e41b06fc3627bcc51f38bb07c16122.jpg,"Remote Item","Iowa State University Library Iowa County Histories",1,0
70355,https://www.iowaheritage.org/items/show/70355,"Monroe County History, Iowa","Monroe County (Iowa)|History","Compiled and written by the Iowa Writers' program of the Work Projects Administration for the state of Iowa. Sponsored by county superintendent of schools, Monroe county.","Iowa Writers' Program of the Works Projects Administration in the State of Iowa","F627 M75w","Iowa State University Library http://www.lib.iastate.edu",1940|2003-07,,"U.S. and international copyright laws protect this digital image. Commercial use or distribution of the image is not permitted without prior permission of the copyright holder.",,"92 pages; 28 cm|Monograph|PDF",,"Text; Image",F627.M75w|https://digitalcollections.lib.iastate.edu/,,,,,,,,,,,,,,,,,,,,,,,,,,,,,,,,,,,,,,,,,,,,,,,,"<a href=""https://digitalcollections.lib.iastate.edu/"" target=""_blank"">View this item in its source respository</a>",,,,,,,,,,,,,,,,,,,,,,,,,,,,,https://www.iowaheritage.org/files/original/1fe9495cff3b01d5a32ae5c5558cc379.jpg,"Remote Item",,1,0
68562,https://www.iowaheritage.org/items/show/68562,"National American Woman Suffrage Association brochures, 1913-1920","Women's suffrage|Harper, Ida Husted, 1851-1931|National American Woman Suffrage Association|United States -- New York -- New York|1910-1920|Women|History|Pacifism|Abolition movement|Organizations|Politics & government|Political participation|Prohibition|Voting|Monuments & memorials|Blackwell, Alice Stone, 1857-1950|Shaw, Anna Howard, 1847-1919|Catt, Carrie Chapman, 1859-1947|League of Women Voters (U.S.)",,"Harper, Ida Husted, 1851-1931; Blackwell, Alice Stone, 1857-1950",,"National Woman Suffrage Publishing Co.|Iowa Women's Archives",191-|2010-10-20,,"Educational use only, no other permissions given. U.S. and International copyright laws may protect this item. Commercial use or distribution of this digital object is not permitted without written permission of the Iowa Women's Archives.","Iowa Women's Suffrage|Iowa Suffrage Memorial Commission records|http://lib.uiowa.edu/collguides/?IWA0398|NAWSA Brochures, 1913-1920",jpeg|32|24,,Text|Brochures,IWA0398|index.cpd|http://digital.lib.uiowa.edu/cdm/ref/collection/suffrage/id/1703,,,,,,,,,,,,,,,,,,,,,,,,,,,,,,,,,,,,,,,,,,,,,,,,"<a href=""http://digital.lib.uiowa.edu/cdm/ref/collection/suffrage/id/1703"" target=""_blank"">View this item in its source respository</a>",,,,,,,,,,,,,,,,,,,,,,,,,,,,,https://www.iowaheritage.org/files/original/d1bb71cf036ede9365bc2914e8d4a6a3.jpg,"Remote Item",,1,0
9543,https://www.iowaheritage.org/items/show/9543,"Now where have we heard that before.","War|Hitler, Adolf, 1889-1945|Russia|Guns|peace|aggression|international relations|hegemony|human nature|history|Stalin, Joseph, 1879-1953|Poland|Czechoslovakia|Yugoslavia|Estonia|Lithuania|Bulgaria|Romania|Germany|Europe|birds.",,"Darling, Jay N. (Jay Norwood), 1876-1962","The Editorial cartoons of J.N. ""Ding"" Darling [electronic resource] : The Cowles Collection, Drake University, 1912-1962",,1947/09/20|1947,,"Copyright is owned by the ""Ding"" Darling Wildlife Society; it is administered on behalf of the Society by The University of Iowa. While use within the classroom is encouraged without specific authorization, publishing this cartoon in any format requires written permission. See policy and permissions procedure at: http://www.lib.uiowa.edu/spec-coll/services/dingdarling_fees.html","Cowles Library, Drake University, 2507 University Ave., Des Moines, IA 50311-4505.",,,,"470920.jpg|http://ddr.lib.drake.edu/u?/ddarling,6473",,,,,,,,,,,,,,,,,,,,,,,,,,,,,,,,,,,,,,,,,,,,,,,,"<a href=""http://ddr.lib.drake.edu/u?/ddarling,6473"" target=""_blank"">View this item in its source respository</a>",,,,,,,,,,,,,,,,,,,,,,,,,,,,,https://www.iowaheritage.org/files/original/72d6e2eee4e69029cafabc1e975d9962.jpg,"Remote Item","Editorial Cartoons of J.N. ""Ding"" Darling, Drake University",1,0
65964,https://www.iowaheritage.org/items/show/65964,"Old Indian Days: A Story of White Man Beginnings","Indians of North America|Kossuth County|Iowa|History",,"Ingham, Harvey, (1858-1949)",,,1920s|2012-07,,"U.S. and international copyright laws protect this digital image. Commercial use or distribution of the image is not permitted without prior permission of the copyright holder.",,"74 pages; 15 x 23 cm|Monograph|PDF",eng,"Text; Image|application/pdf","Old Indian Days|https://digitalcollections.lib.iastate.edu/",,,,,,,,,,,,,,,,,,,,,,,,,,,,,,,,,,,,,,,,,,,,,,,,"<a href=""https://digitalcollections.lib.iastate.edu/"" target=""_blank"">View this item in its source respository</a>",,,,,,,,,,,,,,,,,,,,,,,,,,,,,https://www.iowaheritage.org/files/original/8836b4f8a61338bf50930a96a5be5e23.jpg,"Remote Item","Iowa State University Library Iowa History Collection",1,1
70377,https://www.iowaheritage.org/items/show/70377,"Old Indian Days: A Story of White Man Beginnings","Indians of North America|Kossuth County|Iowa|History",,"Ingham, Harvey, (1858-1949)",,,1920s|2012-07,,"U.S. and international copyright laws protect this digital image. Commercial use or distribution of the image is not permitted without prior permission of the copyright holder.",,"74 pages; 15 x 23 cm|Monograph|PDF",eng,"Text; Image|application/pdf","Old Indian Days|https://digitalcollections.lib.iastate.edu/",,,,,,,,,,,,,,,,,,,,,,,,,,,,,,,,,,,,,,,,,,,,,,,,"<a href=""https://digitalcollections.lib.iastate.edu/"" target=""_blank"">View this item in its source respository</a>",,,,,,,,,,,,,,,,,,,,,,,,,,,,,https://www.iowaheritage.org/files/original/0f8c7e6c6711fe8ff7a11796724844d2.jpg,"Remote Item",,1,0
65959,https://www.iowaheritage.org/items/show/65959,"Osceola County History, Iowa","Osceola County (Iowa)|History","Compiled and written by the Iowa Writers' Program of the Work Projects Administration in the state of Iowa. Jessie M. Parker, state superintendent of public instruction, state-wide sponsor of the Iowa Writers' program. Sponsored by Osceola County superintendent of schools, Sibley, Iowa.","Iowa Writers' Program of the Works Projects Administration in the State of Iowa","F627 O8w 2002","Iowa State University Library http://www.lib.iastate.edu",1942|2002-10,,"U.S. and international copyright laws protect this digital image. Commercial use or distribution of the image is not permitted without prior permission of the copyright holder.",,"61 pages; 27 cm|Monograph|PDF",,"Text; Image",F627.O8w.2002|https://digitalcollections.lib.iastate.edu/,,,,,,,,,,,,,,,,,,,,,,,,,,,,,,,,,,,,,,,,,,,,,,,,"<a href=""https://digitalcollections.lib.iastate.edu/"" target=""_blank"">View this item in its source respository</a>",,,,,,,,,,,,,,,,,,,,,,,,,,,,,https://www.iowaheritage.org/files/original/cff636ac21643de32cdf2b00e8b29c93.jpg,"Remote Item","Iowa State University Library Iowa County Histories",1,0
70353,https://www.iowaheritage.org/items/show/70353,"Osceola County History, Iowa","Osceola County (Iowa)|History","Compiled and written by the Iowa Writers' Program of the Work Projects Administration in the state of Iowa. Jessie M. Parker, state superintendent of public instruction, state-wide sponsor of the Iowa Writers' program. Sponsored by Osceola County superintendent of schools, Sibley, Iowa.","Iowa Writers' Program of the Works Projects Administration in the State of Iowa","F627 O8w 2002","Iowa State University Library http://www.lib.iastate.edu",1942|2002-10,,"U.S. and international copyright laws protect this digital image. Commercial use or distribution of the image is not permitted without prior permission of the copyright holder.",,"61 pages; 27 cm|Monograph|PDF",,"Text; Image",F627.O8w.2002|https://digitalcollections.lib.iastate.edu/,,,,,,,,,,,,,,,,,,,,,,,,,,,,,,,,,,,,,,,,,,,,,,,,"<a href=""https://digitalcollections.lib.iastate.edu/"" target=""_blank"">View this item in its source respository</a>",,,,,,,,,,,,,,,,,,,,,,,,,,,,,https://www.iowaheritage.org/files/original/59542730abac9527cba9603c311bd135.jpg,"Remote Item",,1,0
65974,https://www.iowaheritage.org/items/show/65974,"Page County History, Iowa","Page County (Iowa)|History","Compiled and written by the Iowa Writers' Program of the Work Projects Administration in the state of Iowa. Jessie M. Parker, state superintendent of public instruction, state-wide sponsor of the Iowa Writers' program. Sponsored by Page County superintendent of schools, Clarinda, Iowa.","Iowa Writers' Program of the Works Projects Administration in the State of Iowa","F627 P2w 2002","Iowa State University Library http://www.lib.iastate.edu",1942|2002-10,,"U.S. and international copyright laws protect this digital image. Commercial use or distribution of the image is not permitted without prior permission of the copyright holder.",,"104 pages; 28 cm|Monograph|PDF",,"Text; Image",F627.P2w.2002|https://digitalcollections.lib.iastate.edu/,,,,,,,,,,,,,,,,,,,,,,,,,,,,,,,,,,,,,,,,,,,,,,,,"<a href=""https://digitalcollections.lib.iastate.edu/"" target=""_blank"">View this item in its source respository</a>",,,,,,,,,,,,,,,,,,,,,,,,,,,,,https://www.iowaheritage.org/files/original/1d8e4c68766a1776da4fdde27e0c0741.jpg,"Remote Item","Iowa State University Library Iowa County Histories",1,0
70362,https://www.iowaheritage.org/items/show/70362,"Page County History, Iowa","Page County (Iowa)|History","Compiled and written by the Iowa Writers' Program of the Work Projects Administration in the state of Iowa. Jessie M. Parker, state superintendent of public instruction, state-wide sponsor of the Iowa Writers' program. Sponsored by Page County superintendent of schools, Clarinda, Iowa.","Iowa Writers' Program of the Works Projects Administration in the State of Iowa","F627 P2w 2002","Iowa State University Library http://www.lib.iastate.edu",1942|2002-10,,"U.S. and international copyright laws protect this digital image. Commercial use or distribution of the image is not permitted without prior permission of the copyright holder.",,"104 pages; 28 cm|Monograph|PDF",,"Text; Image",F627.P2w.2002|https://digitalcollections.lib.iastate.edu/,,,,,,,,,,,,,,,,,,,,,,,,,,,,,,,,,,,,,,,,,,,,,,,,"<a href=""https://digitalcollections.lib.iastate.edu/"" target=""_blank"">View this item in its source respository</a>",,,,,,,,,,,,,,,,,,,,,,,,,,,,,https://www.iowaheritage.org/files/original/057f674c62093caf09d70ee8c0d3c4af.jpg,"Remote Item",,1,0
