 




﻿"Item Id","Item URI","Dublin Core:Title","Dublin Core:Subject","Dublin Core:Description","Dublin Core:Creator","Dublin Core:Source","Dublin Core:Publisher","Dublin Core:Date","Dublin Core:Contributor","Dublin Core:Rights","Dublin Core:Relation","Dublin Core:Format","Dublin Core:Language","Dublin Core:Type","Dublin Core:Identifier","Dublin Core:Coverage","Item Type Metadata:Text","Item Type Metadata:Interviewer","Item Type Metadata:Interviewee","Item Type Metadata:Location","Item Type Metadata:Transcription","Item Type Metadata:Local URL","Item Type Metadata:Original Format","Item Type Metadata:Physical Dimensions","Item Type Metadata:Duration","Item Type Metadata:Compression","Item Type Metadata:Producer","Item Type Metadata:Director","Item Type Metadata:Bit Rate/Frequency","Item Type Metadata:Time Summary","Item Type Metadata:Email Body","Item Type Metadata:Subject Line","Item Type Metadata:From","Item Type Metadata:To","Item Type Metadata:CC","Item Type Metadata:BCC","Item Type Metadata:Number of Attachments","Item Type Metadata:Standards","Item Type Metadata:Objectives","Item Type Metadata:Materials","Item Type Metadata:Lesson Plan Text","Item Type Metadata:URL","Item Type Metadata:Event Type","Item Type Metadata:Participants","Item Type Metadata:Birth Date","Item Type Metadata:Birthplace","Item Type Metadata:Death Date","Item Type Metadata:Occupation","Item Type Metadata:Biographical Text","Item Type Metadata:Bibliography","Item Type Metadata:Digital Reproduction Information","Item Type Metadata:Repository","Item Type Metadata:Repository Collection","Item Type Metadata:Contact information.","Item Type Metadata:File Name","Item Type Metadata:Notes","Item Type Metadata:Digital item created","Item Type Metadata:Digital item modified","Item Type Metadata:Executive Orders","Item Type Metadata:Record Created","Item Type Metadata:Record Modified","Item Type Metadata:Transcription2","Item Type Metadata:Source URL","Omeka Legacy File:Additional Creator","Omeka Legacy File:Transcriber","Omeka Legacy File:Producer","Omeka Legacy File:Render Device","Omeka Legacy File:Render Details","Omeka Legacy File:Capture Date","Omeka Legacy File:Capture Device","Omeka Legacy File:Capture Details","Omeka Legacy File:Change History","Omeka Legacy File:Watermark","Omeka Legacy File:Encryption","Omeka Legacy File:Compression","Omeka Legacy File:Post Processing","Omeka Image File:Width","Omeka Image File:Height","Omeka Image File:Bit Depth","Omeka Image File:Channels","Omeka Image File:Exif String","Omeka Image File:Exif Array","Omeka Image File:IPTC String","Omeka Image File:IPTC Array","Omeka Video File:Bitrate","Omeka Video File:Duration","Omeka Video File:Sample Rate","Omeka Video File:Codec","Omeka Video File:Width","Omeka Video File:Height",tags,file,itemType,collection,public,featured
21717,https://www.iowaheritage.org/items/show/21717,"Cadets lying in field with rifles at Camp Macbride, The University of Iowa, April 14, 1917","Cadets|University of Iowa. Dept. of Military Science|United States -- Iowa -- Iowa City|1910-1920|Military training",,"Kent, Frederick W. (Frederick Wallace), 1894-1984",,"The University of Iowa. Libraries. University Archives",1917-04-14|2008-03-14,,"Educational use only, no other permissions given. U.S. and international copyright laws may protect this digital object. Commercial use or distribution of the object is not permitted without prior permission of the copyright holder.","Iowa City Town and Campus Scenes|Frederick W. Kent collection of photographs, 1866-2000|http://www.lib.uiowa.edu/collguides/?RG30.0001.01|Prints|Colleges and departments|Military|Military|Scanned with Ricoh Aficio 3228C at 600 ppi, full color. Master images saved in tiff format.",8|13,,"Still image|Photographs|jpeg",RG30.0001.01|mil270.jpg|https://digital.lib.uiowa.edu/,,,,,,,,,,,,,,,,,,,,,,,,,,,,,,,,,,,,,,,,,,,,,,,,"<a href=""https://digital.lib.uiowa.edu/"" target=""_blank"">View this item in its source respository</a>",,,,,,,,,,,,,,,,,,,,,,,,,,,,,https://www.iowaheritage.org/files/original/2959fed4192e06e0c4e951edf20543f6.jpg,"Remote Item","Iowa City Town and Campus Scenes",1,0
21725,https://www.iowaheritage.org/items/show/21725,"Inspection of ranks, The University of Iowa, April 20, 1917","Cadets|University of Iowa. Dept. of Military Science|United States -- Iowa -- Iowa City|1910-1920|Military inspections",,"Kent, Frederick W. (Frederick Wallace), 1894-1984",,"The University of Iowa. Libraries. University Archives",1917-04-20|2008-03-14,,"Educational use only, no other permissions given. U.S. and international copyright laws may protect this digital object. Commercial use or distribution of the object is not permitted without prior permission of the copyright holder.","Iowa City Town and Campus Scenes|Frederick W. Kent collection of photographs, 1866-2000|http://www.lib.uiowa.edu/collguides/?RG30.0001.01|Prints|Colleges and departments|Military|Military|Scanned with Ricoh Aficio 3228C at 600 ppi, full color. Master images saved in tiff format.",8|13,,"Still image|Photographs|jpeg",RG30.0001.01|mil274.jpg|https://digital.lib.uiowa.edu/,,,,,,,,,,,,,,,,,,,,,,,,,,,,,,,,,,,,,,,,,,,,,,,,"<a href=""https://digital.lib.uiowa.edu/"" target=""_blank"">View this item in its source respository</a>",,,,,,,,,,,,,,,,,,,,,,,,,,,,,https://www.iowaheritage.org/files/original/7ff6e4d43081e127a48d91ec04ec4b63.jpg,"Remote Item","Iowa City Town and Campus Scenes",1,0
21733,https://www.iowaheritage.org/items/show/21733,"Governor's Day on Iowa Field, flag presented, The University of Iowa, April 20, 1917","Cadets|University of Iowa. Dept. of Military Science|United States -- Iowa -- Iowa City|1910-1920|Military parades and ceremonies|Flag bearers",,"Kent, Frederick W. (Frederick Wallace), 1894-1984",,"The University of Iowa. Libraries. University Archives",1917-04-20|2008-03-14,,"Educational use only, no other permissions given. U.S. and international copyright laws may protect this digital object. Commercial use or distribution of the object is not permitted without prior permission of the copyright holder.","Iowa City Town and Campus Scenes|Frederick W. Kent collection of photographs, 1866-2000|http://www.lib.uiowa.edu/collguides/?RG30.0001.01|Prints|Colleges and departments|Military|Military|Scanned with Ricoh Aficio 3228C at 600 ppi, full color. Master images saved in tiff format.",8|13,,"Still image|Photographs|jpeg",RG30.0001.01|mil278.jpg|https://digital.lib.uiowa.edu/,,,,,,,,,,,,,,,,,,,,,,,,,,,,,,,,,,,,,,,,,,,,,,,,"<a href=""https://digital.lib.uiowa.edu/"" target=""_blank"">View this item in its source respository</a>",,,,,,,,,,,,,,,,,,,,,,,,,,,,,https://www.iowaheritage.org/files/original/e3c88973498406a80e4f983802354619.jpg,"Remote Item","Iowa City Town and Campus Scenes",1,0
21736,https://www.iowaheritage.org/items/show/21736,"Governor William L. Harding saluting colors during inspection on Iowa Field, The University of Iowa, May 12, 1917","Cadets|Harding, William Lloyd, 1877-1934.|University of Iowa. Dept. of Military Science|United States -- Iowa -- Iowa City|1910-1920|Military parades and ceremonies|Governors|Flag bearers|Macbride, Thomas H. (Thomas Huston), 1848-1934","University of Iowa President Thomas H. Macbride in gown on right.","Kent, Frederick W. (Frederick Wallace), 1894-1984",,"The University of Iowa. Libraries. University Archives",1917-05-12|2008-03-14,,"Educational use only, no other permissions given. U.S. and international copyright laws may protect this digital object. Commercial use or distribution of the object is not permitted without prior permission of the copyright holder.","Iowa City Town and Campus Scenes|Frederick W. Kent collection of photographs, 1866-2000|http://www.lib.uiowa.edu/collguides/?RG30.0001.01|Prints|Colleges and departments|Military|Military|Scanned with Ricoh Aficio 3228C at 600 ppi, full color. Master images saved in tiff format.",8|13,,"Still image|Photographs|jpeg",RG30.0001.01|mil280.jpg|https://digital.lib.uiowa.edu/,,,,,,,,,,,,,,,,,,,,,,,,,,,,,,,,,,,,,,,,,,,,,,,,"<a href=""https://digital.lib.uiowa.edu/"" target=""_blank"">View this item in its source respository</a>",,,,,,,,,,,,,,,,,,,,,,,,,,,,,https://www.iowaheritage.org/files/original/4d6f14ea15c4f8a882870ae5bc8dd5a6.jpg,"Remote Item","Iowa City Town and Campus Scenes",1,0
21738,https://www.iowaheritage.org/items/show/21738,"Cadets marching west on Washington Street, The University of Iowa, 1917","Cadets|University of Iowa. Dept. of Military Science|United States -- Iowa -- Iowa City|1910-1920|Military parades and ceremonies","Engineering shops and Engineering building on right.  Armory (not visible) on left.","Kent, Frederick W. (Frederick Wallace), 1894-1984",,"The University of Iowa. Libraries. University Archives",1917|2008-03-14,,"Educational use only, no other permissions given. U.S. and international copyright laws may protect this digital object. Commercial use or distribution of the object is not permitted without prior permission of the copyright holder.","Iowa City Town and Campus Scenes|Frederick W. Kent collection of photographs, 1866-2000|http://www.lib.uiowa.edu/collguides/?RG30.0001.01|Prints|Colleges and departments|Military|Military|Scanned with Ricoh Aficio 3228C at 600 ppi, full color. Master images saved in tiff format.",8|13,,"Still image|Photographs|jpeg",RG30.0001.01|mil281.jpg|https://digital.lib.uiowa.edu/,,,,,,,,,,,,,,,,,,,,,,,,,,,,,,,,,,,,,,,,,,,,,,,,"<a href=""https://digital.lib.uiowa.edu/"" target=""_blank"">View this item in its source respository</a>",,,,,,,,,,,,,,,,,,,,,,,,,,,,,https://www.iowaheritage.org/files/original/84f467deb8649703eaba91b73d8d3c44.jpg,"Remote Item","Iowa City Town and Campus Scenes",1,0
21756,https://www.iowaheritage.org/items/show/21756,"Semaphore flag signaling practice near Armory, The University of Iowa, 1917","Cadets|University of Iowa. Dept. of Military Science|United States -- Iowa -- Iowa City|1910-1920|Signal flags|Signaling",,"Kent, Frederick W. (Frederick Wallace), 1894-1984",,"The University of Iowa. Libraries. University Archives",1917|2008-03-14,,"Educational use only, no other permissions given. U.S. and international copyright laws may protect this digital object. Commercial use or distribution of the object is not permitted without prior permission of the copyright holder.","Iowa City Town and Campus Scenes|Frederick W. Kent collection of photographs, 1866-2000|http://www.lib.uiowa.edu/collguides/?RG30.0001.01|Prints|Colleges and departments|Military|Military|Scanned with Ricoh Aficio 3228C at 600 ppi, full color. Master images saved in tiff format.",8|13,,"Still image|Photographs|jpeg",RG30.0001.01|mil290.jpg|https://digital.lib.uiowa.edu/,,,,,,,,,,,,,,,,,,,,,,,,,,,,,,,,,,,,,,,,,,,,,,,,"<a href=""https://digital.lib.uiowa.edu/"" target=""_blank"">View this item in its source respository</a>",,,,,,,,,,,,,,,,,,,,,,,,,,,,,https://www.iowaheritage.org/files/original/207de0448cf5360607dff7355d658684.jpg,"Remote Item","Iowa City Town and Campus Scenes",1,0
21758,https://www.iowaheritage.org/items/show/21758,"Semaphore flag signaling practice south of Old Armory, The University of Iowa, 1917","Cadets|University of Iowa. Dept. of Military Science|United States -- Iowa -- Iowa City|1910-1920|Signal flags|Signaling|Old Armory (Iowa City, Iowa)",,"Kent, Frederick W. (Frederick Wallace), 1894-1984",,"The University of Iowa. Libraries. University Archives",1917|2008-03-14,,"Educational use only, no other permissions given. U.S. and international copyright laws may protect this digital object. Commercial use or distribution of the object is not permitted without prior permission of the copyright holder.","Iowa City Town and Campus Scenes|Frederick W. Kent collection of photographs, 1866-2000|http://www.lib.uiowa.edu/collguides/?RG30.0001.01|Prints|Colleges and departments|Military|Military|Scanned with Ricoh Aficio 3228C at 600 ppi, full color. Master images saved in tiff format.",8|13,,"Still image|Photographs|jpeg",RG30.0001.01|mil291.jpg|https://digital.lib.uiowa.edu/,41.66018|-91.53832,,,,,,,,,,,,,,,,,,,,,,,,,,,,,,,,,,,,,,,,,,,,,,,"<a href=""https://digital.lib.uiowa.edu/"" target=""_blank"">View this item in its source respository</a>",,,,,,,,,,,,,,,,,,,,,,,,,,,,,https://www.iowaheritage.org/files/original/0e139f6da55dfc3313e9dfcd04729476.jpg,"Remote Item","Iowa City Town and Campus Scenes",1,0
21766,https://www.iowaheritage.org/items/show/21766,"Inspection on Iowa Field, rifle signal shot from rear of formation, The University of Iowa, April 4, 1918","Cadets|University of Iowa. Dept. of Military Science|United States -- Iowa -- Iowa City|1910-1920|Military inspections",,"Kent, Frederick W. (Frederick Wallace), 1894-1984",,"The University of Iowa. Libraries. University Archives",1918-04-04|2008-03-14,,"Educational use only, no other permissions given. U.S. and international copyright laws may protect this digital object. Commercial use or distribution of the object is not permitted without prior permission of the copyright holder.","Iowa City Town and Campus Scenes|Frederick W. Kent collection of photographs, 1866-2000|http://www.lib.uiowa.edu/collguides/?RG30.0001.01|Prints|Colleges and departments|Military|Military|Scanned with Ricoh Aficio 3228C at 600 ppi, full color. Master images saved in tiff format.",8|13,,"Still image|Photographs|jpeg",RG30.0001.01|mil295.jpg|https://digital.lib.uiowa.edu/,,,,,,,,,,,,,,,,,,,,,,,,,,,,,,,,,,,,,,,,,,,,,,,,"<a href=""https://digital.lib.uiowa.edu/"" target=""_blank"">View this item in its source respository</a>",,,,,,,,,,,,,,,,,,,,,,,,,,,,,https://www.iowaheritage.org/files/original/629d52cc47926d85e40e65275103a485.jpg,"Remote Item","Iowa City Town and Campus Scenes",1,0
21768,https://www.iowaheritage.org/items/show/21768,"Inspection of flag bearers on Iowa Field, The University of Iowa, April 4, 1918","Cadets|University of Iowa. Dept. of Military Science|United States -- Iowa -- Iowa City|1910-1920|Flag bearers|Military inspections|Iowa Field (Iowa City, Iowa)",,"Kent, Frederick W. (Frederick Wallace), 1894-1984",,"The University of Iowa. Libraries. University Archives",1918-04-04|2008-03-14,,"Educational use only, no other permissions given. U.S. and international copyright laws may protect this digital object. Commercial use or distribution of the object is not permitted without prior permission of the copyright holder.","Iowa City Town and Campus Scenes|Frederick W. Kent collection of photographs, 1866-2000|http://www.lib.uiowa.edu/collguides/?RG30.0001.01|Prints|Colleges and departments|Military|Military|Scanned with Ricoh Aficio 3228C at 600 ppi, full color. Master images saved in tiff format.",8|13,,"Still image|Photographs|jpeg",RG30.0001.01|mil296.jpg|https://digital.lib.uiowa.edu/,,,,,,,,,,,,,,,,,,,,,,,,,,,,,,,,,,,,,,,,,,,,,,,,"<a href=""https://digital.lib.uiowa.edu/"" target=""_blank"">View this item in its source respository</a>",,,,,,,,,,,,,,,,,,,,,,,,,,,,,https://www.iowaheritage.org/files/original/78ae6d31e5f53614643addae7caadf18.jpg,"Remote Item","Iowa City Town and Campus Scenes",1,0
21776,https://www.iowaheritage.org/items/show/21776,"Battalion formation on Iowa Field, The University of Iowa, 1918","Cadets|University of Iowa. Dept. of Military Science|United States -- Iowa -- Iowa City|1910-1920|Military parades and ceremonies",,"Kent, Frederick W. (Frederick Wallace), 1894-1984",,"The University of Iowa. Libraries. University Archives",1918|2008-03-14,,"Educational use only, no other permissions given. U.S. and international copyright laws may protect this digital object. Commercial use or distribution of the object is not permitted without prior permission of the copyright holder.","Iowa City Town and Campus Scenes|Frederick W. Kent collection of photographs, 1866-2000|http://www.lib.uiowa.edu/collguides/?RG30.0001.01|Prints|Colleges and departments|Military|Military|Scanned with Ricoh Aficio 3228C at 600 ppi, full color. Master images saved in tiff format.",8|13,,"Still image|Photographs|jpeg",RG30.0001.01|mil300.jpg|https://digital.lib.uiowa.edu/,,,,,,,,,,,,,,,,,,,,,,,,,,,,,,,,,,,,,,,,,,,,,,,,"<a href=""https://digital.lib.uiowa.edu/"" target=""_blank"">View this item in its source respository</a>",,,,,,,,,,,,,,,,,,,,,,,,,,,,,https://www.iowaheritage.org/files/original/41c3c3cc6f150c2b46c1e04ab1d975c0.jpg,"Remote Item","Iowa City Town and Campus Scenes",1,0
