 




﻿"Item Id","Item URI","Dublin Core:Title","Dublin Core:Subject","Dublin Core:Description","Dublin Core:Creator","Dublin Core:Source","Dublin Core:Publisher","Dublin Core:Date","Dublin Core:Contributor","Dublin Core:Rights","Dublin Core:Relation","Dublin Core:Format","Dublin Core:Language","Dublin Core:Type","Dublin Core:Identifier","Dublin Core:Coverage","Item Type Metadata:Text","Item Type Metadata:Interviewer","Item Type Metadata:Interviewee","Item Type Metadata:Location","Item Type Metadata:Transcription","Item Type Metadata:Local URL","Item Type Metadata:Original Format","Item Type Metadata:Physical Dimensions","Item Type Metadata:Duration","Item Type Metadata:Compression","Item Type Metadata:Producer","Item Type Metadata:Director","Item Type Metadata:Bit Rate/Frequency","Item Type Metadata:Time Summary","Item Type Metadata:Email Body","Item Type Metadata:Subject Line","Item Type Metadata:From","Item Type Metadata:To","Item Type Metadata:CC","Item Type Metadata:BCC","Item Type Metadata:Number of Attachments","Item Type Metadata:Standards","Item Type Metadata:Objectives","Item Type Metadata:Materials","Item Type Metadata:Lesson Plan Text","Item Type Metadata:URL","Item Type Metadata:Event Type","Item Type Metadata:Participants","Item Type Metadata:Birth Date","Item Type Metadata:Birthplace","Item Type Metadata:Death Date","Item Type Metadata:Occupation","Item Type Metadata:Biographical Text","Item Type Metadata:Bibliography","Item Type Metadata:Digital Reproduction Information","Item Type Metadata:Repository","Item Type Metadata:Repository Collection","Item Type Metadata:Contact information.","Item Type Metadata:File Name","Item Type Metadata:Notes","Item Type Metadata:Digital item created","Item Type Metadata:Digital item modified","Item Type Metadata:Executive Orders","Item Type Metadata:Record Created","Item Type Metadata:Record Modified","Item Type Metadata:Transcription2","Item Type Metadata:Source URL","Omeka Legacy File:Additional Creator","Omeka Legacy File:Transcriber","Omeka Legacy File:Producer","Omeka Legacy File:Render Device","Omeka Legacy File:Render Details","Omeka Legacy File:Capture Date","Omeka Legacy File:Capture Device","Omeka Legacy File:Capture Details","Omeka Legacy File:Change History","Omeka Legacy File:Watermark","Omeka Legacy File:Encryption","Omeka Legacy File:Compression","Omeka Legacy File:Post Processing","Omeka Image File:Width","Omeka Image File:Height","Omeka Image File:Bit Depth","Omeka Image File:Channels","Omeka Image File:Exif String","Omeka Image File:Exif Array","Omeka Image File:IPTC String","Omeka Image File:IPTC Array","Omeka Video File:Bitrate","Omeka Video File:Duration","Omeka Video File:Sample Rate","Omeka Video File:Codec","Omeka Video File:Width","Omeka Video File:Height",tags,file,itemType,collection,public,featured
64299,https://www.iowaheritage.org/items/show/64299,"I'm getting really tired of building one of these things every decade","Floods|Iowa|Noah's ark|2000-2010|Flood relief|Disasters, natural|Rivers|Men|Pigs|Inner tubes|Arks|Clouds|Tools",,"Duffy, Brian, 1955-",,"University of Iowa. Libraries. Special Collections Dept.",2008-06-15|2011-04,,"Educational use only, no other permissions given. Copyright to this digital object is owned by The Des Moines Register; it may not be downloaded, reproduced, or distributed without written permission. For more information, contact the Special Collections Department.","Editorial Cartoons of Brian Duffy; Des Moines Register Cartoonists|Papers of Brian Duffy|Des Moines Register",,English,"Still image|Editorial cartoons",MSC916|duffy-080615|http://digital.lib.uiowa.edu/cdm/ref/collection/duffy/id/137,,,,,,,,,,,,,,,,,,,,,,,,,,,,,,,,,,,,,,,,,,,,,,,,"<a href=""http://digital.lib.uiowa.edu/cdm/ref/collection/duffy/id/137"" target=""_blank"">View this item in its source respository</a>",,,,,,,,,,,,,,,,,,,,,,,,,,,,,https://www.iowaheritage.org/files/original/3d0580f9b06ab134d393cdafe629f41f.jpg,"Remote Item","Editorial Cartoons of Brian Duffy",1,0
7908,https://www.iowaheritage.org/items/show/7908,"If it isn't one thing it's another.","Human nature|Snow|weather|winter|floods|floods.",,"Darling, Jay N. (Jay Norwood), 1876-1962","The Editorial cartoons of J.N. ""Ding"" Darling [electronic resource] : The Cowles Collection, Drake University, 1912-1962",,1936/03/17|1936,,"Copyright is owned by the ""Ding"" Darling Wildlife Society; it is administered on behalf of the Society by The University of Iowa. While use within the classroom is encouraged without specific authorization, publishing this cartoon in any format requires written permission. See policy and permissions procedure at: http://www.lib.uiowa.edu/spec-coll/services/dingdarling_fees.html","Cowles Library, Drake University, 2507 University Ave., Des Moines, IA 50311-4505.",,,,"360317.jpg|http://ddr.lib.drake.edu/u?/ddarling,4837",,,,,,,,,,,,,,,,,,,,,,,,,,,,,,,,,,,,,,,,,,,,,,,,"<a href=""http://ddr.lib.drake.edu/u?/ddarling,4837"" target=""_blank"">View this item in its source respository</a>",,,,,,,,,,,,,,,,,,,,,,,,,,,,,https://www.iowaheritage.org/files/original/40f916617e85cc96b54b75de8f967023.jpg,"Remote Item","Editorial Cartoons of J.N. ""Ding"" Darling, Drake University",1,0
12100,https://www.iowaheritage.org/items/show/12100,"IMU Bookstore relocated, The University of Iowa, June 27, 2008","Floods|United States -- Iowa -- Iowa City|2000-2010|Evacuations|Disaster relief","The IMU Bookstore temporary location in the Old Capitol Center mall downtown Iowa City.  The IMU lower level was completely flooded during the 2008 flooding.","Jorgensen, Tom",,,2008-06-27|2008-06-27,,,"080627 IMU Bookstore Relocated",jpeg|19|28,,"Still image|photographs",https://digital.lib.uiowa.edu/,,,,,,,,,,,,,,,,,,,,,,,,,,,,,,,,,,,,,,,,,,,,,,,,"<a href=""https://digital.lib.uiowa.edu/"" target=""_blank"">View this item in its source respository</a>",,,,,,,,,,,,,,,,,,,,,,,,,,,,,https://www.iowaheritage.org/files/original/053bac9f370e2a724aa35cccd13f0009.jpg,"Remote Item","Iowa City Flood",1,0
12157,https://www.iowaheritage.org/items/show/12157,"IMU Bookstore relocated, The University of Iowa, June 27, 2008","Floods|United States -- Iowa -- Iowa City|2000-2010|Evacuations|Disaster relief","The IMU Bookstore temporary location in the Old Capitol Center mall downtown Iowa City.  The IMU lower level was completely flooded during the 2008 flooding.","Jorgensen, Tom",,,2008-06-27|2008-06-27,,,"080627 IMU Bookstore Relocated",jpeg|19|28,,"Still image|photographs",https://digital.lib.uiowa.edu/,,,,,,,,,,,,,,,,,,,,,,,,,,,,,,,,,,,,,,,,,,,,,,,,"<a href=""https://digital.lib.uiowa.edu/"" target=""_blank"">View this item in its source respository</a>",,,,,,,,,,,,,,,,,,,,,,,,,,,,,https://www.iowaheritage.org/files/original/f98bdcad47bc884fd827549b68ba2088.jpg,"Remote Item","Iowa City Flood",1,0
11908,https://www.iowaheritage.org/items/show/11908,"IMU restoration, The University of Iowa, September 12, 2008","Floods|United States -- Iowa -- Iowa City|2000-2010|Evacuations|Disaster relief","Flood restoration and cleanup in the IMU. These photos are from the ground level where ductwork had to be cleaned, the basement level where walls were taken out down to their studs and the sub-basement.","Schoon, Tim",,,2008-09-12|2008-09-12,,,"080912-1-IMU restoration",jpeg|19|28,,"Still image|photographs",https://digital.lib.uiowa.edu/,,,,,,,,,,,,,,,,,,,,,,,,,,,,,,,,,,,,,,,,,,,,,,,,"<a href=""https://digital.lib.uiowa.edu/"" target=""_blank"">View this item in its source respository</a>",,,,,,,,,,,,,,,,,,,,,,,,,,,,,https://www.iowaheritage.org/files/original/40ab69669987cd0be11a09bdaa676b94.jpg,"Remote Item","Iowa City Flood",1,0
12076,https://www.iowaheritage.org/items/show/12076,"IMU restoration, The University of Iowa, September 12, 2008","Floods|United States -- Iowa -- Iowa City|2000-2010|Evacuations|Disaster relief","Flood restoration and cleanup in the IMU. These photos are from the ground level where ductwork had to be cleaned, the basement level where walls were taken out down to their studs and the sub-basement.","Schoon, Tim",,,2008-09-12|2008-09-12,,,"080912-1-IMU restoration",jpeg|19|28,,"Still image|photographs",https://digital.lib.uiowa.edu/,,,,,,,,,,,,,,,,,,,,,,,,,,,,,,,,,,,,,,,,,,,,,,,,"<a href=""https://digital.lib.uiowa.edu/"" target=""_blank"">View this item in its source respository</a>",,,,,,,,,,,,,,,,,,,,,,,,,,,,,https://www.iowaheritage.org/files/original/a359427042e0cd3b9853a776c4fd26fa.jpg,"Remote Item","Iowa City Flood",1,0
12077,https://www.iowaheritage.org/items/show/12077,"IMU restoration, The University of Iowa, September 12, 2008","Floods|United States -- Iowa -- Iowa City|2000-2010|Evacuations|Disaster relief","Flood restoration and cleanup in the IMU. These photos are from the ground level where ductwork had to be cleaned, the basement level where walls were taken out down to their studs and the sub-basement.","Schoon, Tim",,,2008-09-12|2008-09-12,,,"080912-1-IMU restoration",jpeg|19|28,,"Still image|photographs",https://digital.lib.uiowa.edu/,,,,,,,,,,,,,,,,,,,,,,,,,,,,,,,,,,,,,,,,,,,,,,,,"<a href=""https://digital.lib.uiowa.edu/"" target=""_blank"">View this item in its source respository</a>",,,,,,,,,,,,,,,,,,,,,,,,,,,,,https://www.iowaheritage.org/files/original/df910f646d1a5e22945e2f8dc4077c74.jpg,"Remote Item","Iowa City Flood",1,0
12115,https://www.iowaheritage.org/items/show/12115,"IMU restoration, The University of Iowa, September 12, 2008","Floods|United States -- Iowa -- Iowa City|2000-2010|Evacuations|Disaster relief","Flood restoration and cleanup in the IMU. These photos are from the ground level where ductwork had to be cleaned, the basement level where walls were taken out down to their studs and the sub-basement.","Schoon, Tim",,,2008-09-12|2008-09-12,,,"080912-1-IMU restoration",jpeg|19|28,,"Still image|photographs",https://digital.lib.uiowa.edu/,,,,,,,,,,,,,,,,,,,,,,,,,,,,,,,,,,,,,,,,,,,,,,,,"<a href=""https://digital.lib.uiowa.edu/"" target=""_blank"">View this item in its source respository</a>",,,,,,,,,,,,,,,,,,,,,,,,,,,,,https://www.iowaheritage.org/files/original/0bfb2ece259927e8b3d730dd070bff5f.jpg,"Remote Item","Iowa City Flood",1,0
12172,https://www.iowaheritage.org/items/show/12172,"IMU restoration, The University of Iowa, September 12, 2008","Floods|United States -- Iowa -- Iowa City|2000-2010|Evacuations|Disaster relief","Flood restoration and cleanup in the IMU. These photos are from the ground level where ductwork had to be cleaned, the basement level where walls were taken out down to their studs and the sub-basement.","Schoon, Tim",,,2008-09-12|2008-09-12,,,"080912-1-IMU restoration",jpeg|19|28,,"Still image|photographs",https://digital.lib.uiowa.edu/,,,,,,,,,,,,,,,,,,,,,,,,,,,,,,,,,,,,,,,,,,,,,,,,"<a href=""https://digital.lib.uiowa.edu/"" target=""_blank"">View this item in its source respository</a>",,,,,,,,,,,,,,,,,,,,,,,,,,,,,https://www.iowaheritage.org/files/original/ef3af939365cb72943661c360c7b57c4.jpg,"Remote Item","Iowa City Flood",1,0
12405,https://www.iowaheritage.org/items/show/12405,"IMU restoration, The University of Iowa, September 12, 2008","Floods|United States -- Iowa -- Iowa City|2000-2010|Evacuations|Disaster relief","Flood restoration and cleanup in the IMU. These photos are from the ground level where ductwork had to be cleaned, the basement level where walls were taken out down to their studs and the sub-basement.","Schoon, Tim",,,2008-09-12|2008-09-12,,,"080912-1-IMU restoration",jpeg|19|28,,"Still image|photographs",https://digital.lib.uiowa.edu/,,,,,,,,,,,,,,,,,,,,,,,,,,,,,,,,,,,,,,,,,,,,,,,,"<a href=""https://digital.lib.uiowa.edu/"" target=""_blank"">View this item in its source respository</a>",,,,,,,,,,,,,,,,,,,,,,,,,,,,,https://www.iowaheritage.org/files/original/a56e0012a455d2d1319fccc2bd11d3f7.jpg,"Remote Item","Iowa City Flood",1,0
