 




﻿"Item Id","Item URI","Dublin Core:Title","Dublin Core:Subject","Dublin Core:Description","Dublin Core:Creator","Dublin Core:Source","Dublin Core:Publisher","Dublin Core:Date","Dublin Core:Contributor","Dublin Core:Rights","Dublin Core:Relation","Dublin Core:Format","Dublin Core:Language","Dublin Core:Type","Dublin Core:Identifier","Dublin Core:Coverage","Item Type Metadata:Text","Item Type Metadata:Interviewer","Item Type Metadata:Interviewee","Item Type Metadata:Location","Item Type Metadata:Transcription","Item Type Metadata:Local URL","Item Type Metadata:Original Format","Item Type Metadata:Physical Dimensions","Item Type Metadata:Duration","Item Type Metadata:Compression","Item Type Metadata:Producer","Item Type Metadata:Director","Item Type Metadata:Bit Rate/Frequency","Item Type Metadata:Time Summary","Item Type Metadata:Email Body","Item Type Metadata:Subject Line","Item Type Metadata:From","Item Type Metadata:To","Item Type Metadata:CC","Item Type Metadata:BCC","Item Type Metadata:Number of Attachments","Item Type Metadata:Standards","Item Type Metadata:Objectives","Item Type Metadata:Materials","Item Type Metadata:Lesson Plan Text","Item Type Metadata:URL","Item Type Metadata:Event Type","Item Type Metadata:Participants","Item Type Metadata:Birth Date","Item Type Metadata:Birthplace","Item Type Metadata:Death Date","Item Type Metadata:Occupation","Item Type Metadata:Biographical Text","Item Type Metadata:Bibliography","Item Type Metadata:Digital Reproduction Information","Item Type Metadata:Repository","Item Type Metadata:Repository Collection","Item Type Metadata:Contact information.","Item Type Metadata:File Name","Item Type Metadata:Notes","Item Type Metadata:Digital item created","Item Type Metadata:Digital item modified","Item Type Metadata:Executive Orders","Item Type Metadata:Record Created","Item Type Metadata:Record Modified","Item Type Metadata:Transcription2","Item Type Metadata:Source URL","Omeka Legacy File:Additional Creator","Omeka Legacy File:Transcriber","Omeka Legacy File:Producer","Omeka Legacy File:Render Device","Omeka Legacy File:Render Details","Omeka Legacy File:Capture Date","Omeka Legacy File:Capture Device","Omeka Legacy File:Capture Details","Omeka Legacy File:Change History","Omeka Legacy File:Watermark","Omeka Legacy File:Encryption","Omeka Legacy File:Compression","Omeka Legacy File:Post Processing","Omeka Image File:Width","Omeka Image File:Height","Omeka Image File:Bit Depth","Omeka Image File:Channels","Omeka Image File:Exif String","Omeka Image File:Exif Array","Omeka Image File:IPTC String","Omeka Image File:IPTC Array","Omeka Video File:Bitrate","Omeka Video File:Duration","Omeka Video File:Sample Rate","Omeka Video File:Codec","Omeka Video File:Width","Omeka Video File:Height",tags,file,itemType,collection,public,featured
4278,https://www.iowaheritage.org/items/show/4278,"Darnit!  Now where's that boy Jimmie gone to?","Politics|Cox, James Middleton, 1870-1957|Elections 1920|Swimmers|elections|candidates|treaties|U.S. Senate|League of Nations|human nature|Democratic Party|Wilson, Woodrow, 1856-1924|swimming holes.",,"Darling, Jay N. (Jay Norwood), 1876-1962","The Editorial cartoons of J.N. ""Ding"" Darling [electronic resource] : The Cowles Collection, Drake University, 1912-1962",,1920/08/03|1920,,"Copyright is owned by the ""Ding"" Darling Wildlife Society; it is administered on behalf of the Society by The University of Iowa. While use within the classroom is encouraged without specific authorization, publishing this cartoon in any format requires written permission. See policy and permissions procedure at: http://www.lib.uiowa.edu/spec-coll/services/dingdarling_fees.html","Cowles Library, Drake University, 2507 University Ave., Des Moines, IA 50311-4505.",,,,"200803.jpg|http://ddr.lib.drake.edu/u?/ddarling,1407",,,,,,,,,,,,,,,,,,,,,,,,,,,,,,,,,,,,,,,,,,,,,,,,"<a href=""http://ddr.lib.drake.edu/u?/ddarling,1407"" target=""_blank"">View this item in its source respository</a>",,,,,,,,,,,,,,,,,,,,,,,,,,,,,https://www.iowaheritage.org/files/original/dd0ce37458887ca163beced1f4082575.jpg,"Remote Item","Editorial Cartoons of J.N. ""Ding"" Darling, Drake University",1,0
4520,https://www.iowaheritage.org/items/show/4520,"Hey there! Keep an eye on the breakers.","Agriculture|Swimmers|business|Federal Reserve Guarantees|credit|shark.",,"Darling, Jay N. (Jay Norwood), 1876-1962","The Editorial cartoons of J.N. ""Ding"" Darling [electronic resource] : The Cowles Collection, Drake University, 1912-1962",,1921/06/07|1921,,"Copyright is owned by the ""Ding"" Darling Wildlife Society; it is administered on behalf of the Society by The University of Iowa. While use within the classroom is encouraged without specific authorization, publishing this cartoon in any format requires written permission. See policy and permissions procedure at: http://www.lib.uiowa.edu/spec-coll/services/dingdarling_fees.html","Cowles Library, Drake University, 2507 University Ave., Des Moines, IA 50311-4505.",,,,"210607.jpg|http://ddr.lib.drake.edu/u?/ddarling,1649",,,,,,,,,,,,,,,,,,,,,,,,,,,,,,,,,,,,,,,,,,,,,,,,"<a href=""http://ddr.lib.drake.edu/u?/ddarling,1649"" target=""_blank"">View this item in its source respository</a>",,,,,,,,,,,,,,,,,,,,,,,,,,,,,https://www.iowaheritage.org/files/original/e0cd02888fa3aea549f8b53a01429a7d.jpg,"Remote Item","Editorial Cartoons of J.N. ""Ding"" Darling, Drake University",1,0
17845,https://www.iowaheritage.org/items/show/17845,"David Arguello in Mississippi River, Holy City, Bettendorf, Iowa, 1920s","Men|Hispanic Americans|Arguello, David|United States -- Iowa -- Bettendorf|1920-1930|Rivers|Swimmers",,unknown,,"University of Iowa. Libraries. Iowa Women's Archives",1920/1929|2007-07-17,,"Educational use only, no other permissions given. U.S. and international copyright laws may protect this item. Commercial use or distribution of this digital object is not permitted without written permission of the Iowa Women's Archives.","Mujeres Latinas Digital Collection|LULAC Council #10 records|LULAC exhibit: Holy City|http://lib.uiowa.edu/collguides/?IWA0733|http://www.lib.uiowa.edu/iwa/Topical_holdings_lists/Latinas.html",jpeg,,"Still image|Photographs",IWA0733|lulac7-1.jpg|162640987|https://digital.lib.uiowa.edu/,,,,,,,,,,,,,,,,,,,,,,,,,,,,,,,,,,,,,,,,,,,,,,,,"<a href=""https://digital.lib.uiowa.edu/"" target=""_blank"">View this item in its source respository</a>",,,,,,,,,,,,,,,,,,,,,,,,,,,,,https://www.iowaheritage.org/files/original/9fba150e81df7bd8a89e32e3e3e5a0fe.jpg,"Remote Item","Mujeres Latinas Digital Collection",1,0
17846,https://www.iowaheritage.org/items/show/17846,"Pete Macias, Joe Aloa, and Tony Navarro, with David Arguello in water, Mississippi River, Holy City, Bettendorf, Iowa, 1920s","Men|Hispanic Americans|Macias, Pete|United States -- Iowa -- Bettendorf|1920-1930|Rivers|Swimmers|Aloa, Joe|Navarro, Tony|Arguello, David",,unknown,,"University of Iowa. Libraries. Iowa Women's Archives",1920/1929|2007-07-17,,"Educational use only, no other permissions given. U.S. and international copyright laws may protect this item. Commercial use or distribution of this digital object is not permitted without written permission of the Iowa Women's Archives.","Mujeres Latinas Digital Collection|LULAC Council #10 records|LULAC exhibit: Holy City|http://lib.uiowa.edu/collguides/?IWA0733|http://www.lib.uiowa.edu/iwa/Topical_holdings_lists/Latinas.html",jpeg,,"Still image|Photographs",IWA0733|lulac7-2.jpg|162640987|https://digital.lib.uiowa.edu/,,,,,,,,,,,,,,,,,,,,,,,,,,,,,,,,,,,,,,,,,,,,,,,,"<a href=""https://digital.lib.uiowa.edu/"" target=""_blank"">View this item in its source respository</a>",,,,,,,,,,,,,,,,,,,,,,,,,,,,,https://www.iowaheritage.org/files/original/72e6c60dfe257b0f116828868e43de55.jpg,"Remote Item","Mujeres Latinas Digital Collection",1,0
17847,https://www.iowaheritage.org/items/show/17847,"Dave Arguello, Pete Macias, and Joe Aloa on banks of Mississippi River, Holy City, Bettendorf, Iowa, 1920s","Men|Hispanic Americans|Arguello, David|United States -- Iowa -- Bettendorf|1920-1930|Rivers|Swimmers|Macias, Pete|Aloa, Joe",,unknown,,"University of Iowa. Libraries. Iowa Women's Archives",1920/1929|2007-07-17,,"Educational use only, no other permissions given. U.S. and international copyright laws may protect this item. Commercial use or distribution of this digital object is not permitted without written permission of the Iowa Women's Archives.","Mujeres Latinas Digital Collection|LULAC Council #10 records|LULAC exhibit: Holy City|http://lib.uiowa.edu/collguides/?IWA0733|http://www.lib.uiowa.edu/iwa/Topical_holdings_lists/Latinas.html",jpeg,,"Still image|Photographs",IWA0733|lulac7-3.jpg|162640987|https://digital.lib.uiowa.edu/,,,,,,,,,,,,,,,,,,,,,,,,,,,,,,,,,,,,,,,,,,,,,,,,"<a href=""https://digital.lib.uiowa.edu/"" target=""_blank"">View this item in its source respository</a>",,,,,,,,,,,,,,,,,,,,,,,,,,,,,https://www.iowaheritage.org/files/original/3827f60875cec6b0596c5f062bc4a365.jpg,"Remote Item","Mujeres Latinas Digital Collection",1,0
18128,https://www.iowaheritage.org/items/show/18128,"Ann Cooper, The University of Iowa, 1950s","Women|Cooper, Ann|University of Iowa. Dept. of Physical Education for Women|United States -- Iowa -- Iowa City|1950-1960|Students|Universities & colleges|Swimmers|Bathing suits|Swimming pools|Diving|University of Iowa. Dept. of Health and Sport Studies","Mother of Iowa governor Chet Culver.",unknown,,"University of Iowa. Libraries. Iowa Women's Archives",1950/1959|2008-04-21,,"Educational use only, no other permissions given. U.S. and international copyright laws may protect this item. Commercial use or distribution of this digital object is not permitted without written permission of the Iowa Women's Archives.","University of Iowa Physical Education for Women|The University of Iowa Department of Physical Education for Women Records, 1900-2006|http://www.lib.uiowa.edu/collguides/?IWA0106|Seals Club",jpeg|21|26,,"Still image|Photographs",IWA0106|uipebs0109.jpg|https://digital.lib.uiowa.edu/,,,,,,,,,,,,,,,,,,,,,,,,,,,,,,,,,,,,,,,,,,,,,,,,"<a href=""https://digital.lib.uiowa.edu/"" target=""_blank"">View this item in its source respository</a>",,,,,,,,,,,,,,,,,,,,,,,,,,,,,https://www.iowaheritage.org/files/original/a22b100515bc273a475f7565a6cbe28f.jpg,"Remote Item","University of Iowa Physical Education for Women",1,0
18135,https://www.iowaheritage.org/items/show/18135,"Ann Cooper, The University of Iowa, 1950s","Women|Cooper, Ann|University of Iowa. Dept. of Physical Education for Women|United States -- Iowa -- Iowa City|1950-1960|Students|Universities & colleges|Swimming pools|Swimmers|Bathing suits|Diving|University of Iowa. Dept. of Health and Sport Studies","Mother of Iowa governor Chet Culver.",unknown,,"University of Iowa. Libraries. Iowa Women's Archives",1950/1959|2008-05-01,,"Educational use only, no other permissions given. U.S. and international copyright laws may protect this item. Commercial use or distribution of this digital object is not permitted without written permission of the Iowa Women's Archives.","University of Iowa Physical Education for Women|The University of Iowa Department of Physical Education for Women Records, 1900-2006|http://www.lib.uiowa.edu/collguides/?IWA0106|Seals Club",jpeg|26|21,,"Still image|Photographs",IWA0106|uipebs0118.jpg|https://digital.lib.uiowa.edu/,,,,,,,,,,,,,,,,,,,,,,,,,,,,,,,,,,,,,,,,,,,,,,,,"<a href=""https://digital.lib.uiowa.edu/"" target=""_blank"">View this item in its source respository</a>",,,,,,,,,,,,,,,,,,,,,,,,,,,,,https://www.iowaheritage.org/files/original/42274b00f257b3b7536f67ac57a8a6c5.jpg,"Remote Item","University of Iowa Physical Education for Women",1,0
18137,https://www.iowaheritage.org/items/show/18137,"Seals Club, The University of Iowa, 1950s","Women|University of Iowa. Dept. of Physical Education for Women|United States -- Iowa -- Iowa City|1950-1960|Students|Universities & colleges|Swimmers|Swimming pools|Bathing suits|University of Iowa. Dept. of Health and Sport Studies",,unknown,,"University of Iowa. Libraries. Iowa Women's Archives",1950/1959|2008-04-21,,"Educational use only, no other permissions given. U.S. and international copyright laws may protect this item. Commercial use or distribution of this digital object is not permitted without written permission of the Iowa Women's Archives.","University of Iowa Physical Education for Women|The University of Iowa Department of Physical Education for Women Records, 1900-2006|http://www.lib.uiowa.edu/collguides/?IWA0106|Seals Club",jpeg|21|26,,"Still image|Photographs; Group portraits",IWA0106|uipebs0107.jpg|https://digital.lib.uiowa.edu/,,,,,,,,,,,,,,,,,,,,,,,,,,,,,,,,,,,,,,,,,,,,,,,,"<a href=""https://digital.lib.uiowa.edu/"" target=""_blank"">View this item in its source respository</a>",,,,,,,,,,,,,,,,,,,,,,,,,,,,,https://www.iowaheritage.org/files/original/6fd538d106d97daf906376b7edfa5b1e.jpg,"Remote Item","University of Iowa Physical Education for Women",1,0
18153,https://www.iowaheritage.org/items/show/18153,"Seals Club picture for The Hawkeye, The University of Iowa, 1960s","Women|University of Iowa. Dept. of Physical Education for Women|United States -- Iowa -- Iowa City|1960-1970|Students|Universities & colleges|Bathing suits|Swimmers|Swimming pools|University of Iowa. Dept. of Health and Sport Studies",,unknown,,"University of Iowa. Libraries. Iowa Women's Archives",1960/1969|2008-04-21,,"Educational use only, no other permissions given. U.S. and international copyright laws may protect this item. Commercial use or distribution of this digital object is not permitted without written permission of the Iowa Women's Archives.","University of Iowa Physical Education for Women|The University of Iowa Department of Physical Education for Women Records, 1900-2006|http://www.lib.uiowa.edu/collguides/?IWA0106|Seals Club",jpeg|21|26,,"Still image|Photographs; Group portraits",IWA0106|uipebs0113.jpg|https://digital.lib.uiowa.edu/,,,,,,,,,,,,,,,,,,,,,,,,,,,,,,,,,,,,,,,,,,,,,,,,"<a href=""https://digital.lib.uiowa.edu/"" target=""_blank"">View this item in its source respository</a>",,,,,,,,,,,,,,,,,,,,,,,,,,,,,https://www.iowaheritage.org/files/original/c0c4ebe70876e9f13502f78f303bd4ca.jpg,"Remote Item","University of Iowa Physical Education for Women",1,0
18155,https://www.iowaheritage.org/items/show/18155,"Synchronized swimmers, The University of Iowa, 1960s","Women|University of Iowa. Dept. of Physical Education for Women|United States -- Iowa -- Iowa City|1960-1970|Students|Universities & colleges|Synchronized swimming|Swimming pools|Swimmers|University of Iowa. Dept. of Health and Sport Studies",,unknown,,"University of Iowa. Libraries. Iowa Women's Archives",1960/1969|2008-05-01,,"Educational use only, no other permissions given. U.S. and international copyright laws may protect this item. Commercial use or distribution of this digital object is not permitted without written permission of the Iowa Women's Archives.","University of Iowa Physical Education for Women|The University of Iowa Department of Physical Education for Women Records, 1900-2006|http://www.lib.uiowa.edu/collguides/?IWA0106|Seals Club",jpeg|26|21,,"Still image|Photographs",IWA0106|uipebs0117.jpg|https://digital.lib.uiowa.edu/,,,,,,,,,,,,,,,,,,,,,,,,,,,,,,,,,,,,,,,,,,,,,,,,"<a href=""https://digital.lib.uiowa.edu/"" target=""_blank"">View this item in its source respository</a>",,,,,,,,,,,,,,,,,,,,,,,,,,,,,https://www.iowaheritage.org/files/original/7a63303f85a4ca799cec07770a985935.jpg,"Remote Item","University of Iowa Physical Education for Women",1,0
