 




﻿"Item Id","Item URI","Dublin Core:Title","Dublin Core:Subject","Dublin Core:Description","Dublin Core:Creator","Dublin Core:Source","Dublin Core:Publisher","Dublin Core:Date","Dublin Core:Contributor","Dublin Core:Rights","Dublin Core:Relation","Dublin Core:Format","Dublin Core:Language","Dublin Core:Type","Dublin Core:Identifier","Dublin Core:Coverage","Item Type Metadata:Text","Item Type Metadata:Interviewer","Item Type Metadata:Interviewee","Item Type Metadata:Location","Item Type Metadata:Transcription","Item Type Metadata:Local URL","Item Type Metadata:Original Format","Item Type Metadata:Physical Dimensions","Item Type Metadata:Duration","Item Type Metadata:Compression","Item Type Metadata:Producer","Item Type Metadata:Director","Item Type Metadata:Bit Rate/Frequency","Item Type Metadata:Time Summary","Item Type Metadata:Email Body","Item Type Metadata:Subject Line","Item Type Metadata:From","Item Type Metadata:To","Item Type Metadata:CC","Item Type Metadata:BCC","Item Type Metadata:Number of Attachments","Item Type Metadata:Standards","Item Type Metadata:Objectives","Item Type Metadata:Materials","Item Type Metadata:Lesson Plan Text","Item Type Metadata:URL","Item Type Metadata:Event Type","Item Type Metadata:Participants","Item Type Metadata:Birth Date","Item Type Metadata:Birthplace","Item Type Metadata:Death Date","Item Type Metadata:Occupation","Item Type Metadata:Biographical Text","Item Type Metadata:Bibliography","Item Type Metadata:Digital Reproduction Information","Item Type Metadata:Repository","Item Type Metadata:Repository Collection","Item Type Metadata:Contact information.","Item Type Metadata:File Name","Item Type Metadata:Notes","Item Type Metadata:Digital item created","Item Type Metadata:Digital item modified","Item Type Metadata:Executive Orders","Item Type Metadata:Record Created","Item Type Metadata:Record Modified","Item Type Metadata:Transcription2","Item Type Metadata:Source URL","Omeka Legacy File:Additional Creator","Omeka Legacy File:Transcriber","Omeka Legacy File:Producer","Omeka Legacy File:Render Device","Omeka Legacy File:Render Details","Omeka Legacy File:Capture Date","Omeka Legacy File:Capture Device","Omeka Legacy File:Capture Details","Omeka Legacy File:Change History","Omeka Legacy File:Watermark","Omeka Legacy File:Encryption","Omeka Legacy File:Compression","Omeka Legacy File:Post Processing","Omeka Image File:Width","Omeka Image File:Height","Omeka Image File:Bit Depth","Omeka Image File:Channels","Omeka Image File:Exif String","Omeka Image File:Exif Array","Omeka Image File:IPTC String","Omeka Image File:IPTC Array","Omeka Video File:Bitrate","Omeka Video File:Duration","Omeka Video File:Sample Rate","Omeka Video File:Codec","Omeka Video File:Width","Omeka Video File:Height",tags,file,itemType,collection,public,featured
78412,https://www.iowaheritage.org/items/show/78412,"World War I troops, June, 1918; Oskaloosa, Iowa; Mahaska County","World War I|Soldiers|Oskaloosa|Iowa|Mahaska County","This is a picture of the men who participated in World War I and was taken in June, 1918.  It is not clear if the men pictured here already had served in the war or if they were about to be sent overseas to fight Germany and the Ottoman Empire.  The reason why this is not known is because the United States was already involved in the war for over a year at this point and the war did not end until November, 1918.","Mahaska County Historical Society","Historical Archives","Mahaska County Historical Society",1918-06|2008-08-01,"Harry and Anna Stephens",www.nelsonpioneer.org,,"still image/jpeg",,image,"Mahaska County Historical Society|http://cdm16125.contentdm.oclc.org/u?/p270701coll7,72",,,,,,,,,,,,,,,,,,,,,,,,,,,,,,,,,,,,,,,,,,,,,,,,"<a href=""http://cdm16125.contentdm.oclc.org/u?/p270701coll7,72"" target=""_blank"">View this item in its source respository</a>",,,,,,,,,,,,,,,,,,,,,,,,,,,,,https://www.iowaheritage.org/files/original/e187a7c4b99fb48146183913404caef2.jpg,"Remote Item","Mahaska County Historical Society",1,0
78411,https://www.iowaheritage.org/items/show/78411,"Horse Thief Squad, Company H, August 9-18, 1915; Oskaloosa, Iowa; Mahaska County","World War I|Soldiers|Horse Thief Squad|Company H|Oskaloosa|Iowa|Mahaska County","This photograph dates to August 9-18, 1915 and depicts the men from Company H who were known as the Horse Thief Squad.  Although the United States did not enter World War I until early 1917, the men in this picture went on to serve in Company H during the Great War.","Mahaska County Historical Society","Historical Archives","Mahaska County Historical Society",1915-08-09|2008-08-01,"Lacey Collection",www.nelsonpioneer.org,,"still image/jpeg",,image,"Mahaska County Historical Society|http://cdm16125.contentdm.oclc.org/u?/p270701coll7,71",,,,,,,,,,,,,,,,,,,,,,,,,,,,,,,,,,,,,,,,,,,,,,,,"<a href=""http://cdm16125.contentdm.oclc.org/u?/p270701coll7,71"" target=""_blank"">View this item in its source respository</a>",,,,,,,,,,,,,,,,,,,,,,,,,,,,,https://www.iowaheritage.org/files/original/1ffcbc522185ec656eb64e6f60582a17.jpg,"Remote Item","Mahaska County Historical Society",1,0
78406,https://www.iowaheritage.org/items/show/78406,"World War I sendoff parade, April 26, 1916, Oskaloosa, Iowa; Mahaska County","World War I|Soldiers|Company H|Oskaloosa|Iowa|Mahaska County","This photograph was taken on April 26, 1916, as the men from Company H departed for Europe in World War I.  The men paraded down High Avenue East in downtown Oskaloosa to be properly sent off by the community and loved ones.  Many of these men went on to serve their country gallantly in France before coming home.  Some of the men did not return home, but those who did make it back didn't return until May 14, 1919, more than three years later, at which time they were greeted whole-heartedly by the community.","Mahaska County Historical Society","Historical Archives","Mahaska County Historical Society",1916-04-26|2008-08-01,"Lacey Collection",www.nelsonpioneer.org,,"still image/jpeg",,image,"Mahaska County Historical Society|http://cdm16125.contentdm.oclc.org/u?/p270701coll7,66",,,,,,,,,,,,,,,,,,,,,,,,,,,,,,,,,,,,,,,,,,,,,,,,"<a href=""http://cdm16125.contentdm.oclc.org/u?/p270701coll7,66"" target=""_blank"">View this item in its source respository</a>",,,,,,,,,,,,,,,,,,,,,,,,,,,,,https://www.iowaheritage.org/files/original/190bb9be07a031c3f61a691409d0f357.jpg,"Remote Item","Mahaska County Historical Society",1,0
78377,https://www.iowaheritage.org/items/show/78377,"Peter Klaaren in uniform with brother Aber, World War I; West Des Moines Township, Iowa; Mahaska County","World War I|Soldiers|West Des Moines Township|Iowa|Mahaska County","This is a picture of Peter Klaaren in his World War I uniform with his brother Aber.  Klaaren hailed from West Des Moines Township in Mahaska County, Iowa.  Klaaren is one of several men who served his country in World War I from Mahaska County, Iowa.","Mahaska County Historical Society","Historical Archives","Mahaska County Historical Society",1917?|2008-08-01,,www.nelsonpioneer.org,,"still image/jpeg",,image,"Mahaska County Historical Society|http://cdm16125.contentdm.oclc.org/u?/p270701coll7,16",,,,,,,,,,,,,,,,,,,,,,,,,,,,,,,,,,,,,,,,,,,,,,,,"<a href=""http://cdm16125.contentdm.oclc.org/u?/p270701coll7,16"" target=""_blank"">View this item in its source respository</a>",,,,,,,,,,,,,,,,,,,,,,,,,,,,,https://www.iowaheritage.org/files/original/f362af1da887eadb1c925e2a30ae6325.jpg,"Remote Item","Mahaska County Historical Society",1,0
78376,https://www.iowaheritage.org/items/show/78376,"Homer McFall, World War I; West Des Moines Township, Iowa; Mahaska County","World War I|Soldiers|West Des Moines Township|Iowa|Mahaska County","This is a picture of Homer McFall in his World War I uniform.  McFall hailed from West Des Moines Township in Mahaska County, Iowa.  McFall is one of several men who served his country in World War I from Mahaska County, Iowa.","Mahaska County Historical Society","Historical Archives","Mahaska County Historical Society",1917?|2008-08-01,,www.nelsonpioneer.org,,"still image/jpeg",,image,"Mahaska County Historical Society|http://cdm16125.contentdm.oclc.org/u?/p270701coll7,15",,,,,,,,,,,,,,,,,,,,,,,,,,,,,,,,,,,,,,,,,,,,,,,,"<a href=""http://cdm16125.contentdm.oclc.org/u?/p270701coll7,15"" target=""_blank"">View this item in its source respository</a>",,,,,,,,,,,,,,,,,,,,,,,,,,,,,https://www.iowaheritage.org/files/original/656d328666f68f89d832bb87f41625c8.jpg,"Remote Item","Mahaska County Historical Society",1,0
78375,https://www.iowaheritage.org/items/show/78375,"Edward Heckenberg, World War I; West Des Moines Township, Iowa; Mahaska County","World War I|Soldiers|West Des Moines Township|Iowa|Mahaska County","This is a picture of Edward Heckenberg in his World War I uniform.  Heckenberg hailed from West Des Moines Township in Mahaska County, Iowa.  Heckenberg is one of several men who served his country in World War I from Mahaska County, Iowa.","Mahaska County Historical Society","Historical Archives","Mahaska County Historical Society",1917?|2008-08-01,,www.nelsonpioneer.org,,"still image/jpeg",,image,"Mahaska County Historical Society|http://cdm16125.contentdm.oclc.org/u?/p270701coll7,14",,,,,,,,,,,,,,,,,,,,,,,,,,,,,,,,,,,,,,,,,,,,,,,,"<a href=""http://cdm16125.contentdm.oclc.org/u?/p270701coll7,14"" target=""_blank"">View this item in its source respository</a>",,,,,,,,,,,,,,,,,,,,,,,,,,,,,https://www.iowaheritage.org/files/original/2fc5c0b02842005f44b77480d6f83702.jpg,"Remote Item","Mahaska County Historical Society",1,0
78374,https://www.iowaheritage.org/items/show/78374,"Frank McCrea, World War I; West Des Moines Township, Iowa; Mahaska County","World War I|Soldiers|West Des Moines Township|Iowa|Mahaska County","This is a picture of Frank McCrea in his World War I uniform.  McCrea hailed from West Des Moines Township in Mahaska County, Iowa.  McCrea is one of several men who served his country in World War I from Mahaska County, Iowa.","Mahaska County Historical Society","Historical Archives","Mahaska County Historical Society",1917?|2008-08-01,,www.nelsonpioneer.org,,"still image/jpeg",,image,"Mahaska County Historical Society|http://cdm16125.contentdm.oclc.org/u?/p270701coll7,13",,,,,,,,,,,,,,,,,,,,,,,,,,,,,,,,,,,,,,,,,,,,,,,,"<a href=""http://cdm16125.contentdm.oclc.org/u?/p270701coll7,13"" target=""_blank"">View this item in its source respository</a>",,,,,,,,,,,,,,,,,,,,,,,,,,,,,https://www.iowaheritage.org/files/original/a494572ec7c37a0fee98f96e80f59fbe.jpg,"Remote Item","Mahaska County Historical Society",1,0
78369,https://www.iowaheritage.org/items/show/78369,"World War I troops roster, June, 1918; Oskaloosa, Iowa; Mahaska County","World War I|Soldiers|Oskaloosa|Iowa|Mahaska County","This is a list of the men who participated in World War I and was taken in June, 1918.  It is not clear if the men pictured here already had served in the war or if they were about to be sent overseas to fight Germany and the Ottoman Empire.  The reason why this is not known is because the United States was already involved in the war for over a year at this point and the war did not end until November, 1918.","Mahaska County Historical Society","Historical Archives","Mahaska County Historical Society",1918-06|2008-08-01,"Harry and Anna Stephens",www.nelsonpioneer.org,,"still image/jpeg",,image,"Mahaska County Historical Society|http://cdm16125.contentdm.oclc.org/u?/p270701coll7,5",,,,,,,,,,,,,,,,,,,,,,,,,,,,,,,,,,,,,,,,,,,,,,,,"<a href=""http://cdm16125.contentdm.oclc.org/u?/p270701coll7,5"" target=""_blank"">View this item in its source respository</a>",,,,,,,,,,,,,,,,,,,,,,,,,,,,,https://www.iowaheritage.org/files/original/6f17883dd4a7f8cb1285f40b2c438199.jpg,"Remote Item","Mahaska County Historical Society",1,0
68455,https://www.iowaheritage.org/items/show/68455,"Camp Dodge photo album, 1918","Soldiers|Pownall, Dorothy Ashby|United States -- Iowa -- Des Moines|1910-1920|Military uniforms|Military camps|Journalists","Album of journalist who reported on Camp Dodge in Iowa during World War I.","Pownall, Dorothy Ashby",,"Iowa Women's Archives",1918|2010-10-20,,"Educational use only, no other permissions given. U.S. and International copyright laws may protect this item. Commercial use or distribution of this digital object is not permitted without written permission of the Iowa Women's Archives.","Iowa Women's Suffrage|Dorothy Ashby Pownall papers|http://lib.uiowa.edu/collguides/?IWA0025|Photo album, 1918",jpeg|18|29,,"Still image|Photograph albums; Photographs",IWA0025|index.cpd|http://digital.lib.uiowa.edu/cdm/ref/collection/suffrage/id/313,,,,,,,,,,,,,,,,,,,,,,,,,,,,,,,,,,,,,,,,,,,,,,,,"<a href=""http://digital.lib.uiowa.edu/cdm/ref/collection/suffrage/id/313"" target=""_blank"">View this item in its source respository</a>",,,,,,,,,,,,,,,,,,,,,,,,,,,,,https://www.iowaheritage.org/files/original/4a084ce0420e464fa9d8f95463f8b4d7.jpg,"Remote Item",,1,0
68383,https://www.iowaheritage.org/items/show/68383,"Women looking at picture of man in uniform, Iowa, 1920s","Women|Soldiers|United States -- Iowa|1920-1930",,unknown,,"University of Iowa. Libraries. Iowa Women's Archives",1920/1929|2007-06-28,,"No known copyright restrictions.","Noble Photographs|Noble Photograph collection|http://www.lib.uiowa.edu/collguides/?IWA0031",,,"Still image|Photographic postcards|jpeg",IWA0031|160192410|http://digital.lib.uiowa.edu/cdm/ref/collection/noble/id/897,,,,,,,,,,,,,,,,,,,,,,,,,,,,,,,,,,,,,,,,,,,,,,,,"<a href=""http://digital.lib.uiowa.edu/cdm/ref/collection/noble/id/897"" target=""_blank"">View this item in its source respository</a>",,,,,,,,,,,,,,,,,,,,,,,,,,,,,https://www.iowaheritage.org/files/original/af4a2e03a6b08bdeb3060775b17c5cbd.jpg,"Remote Item","Mary Noble Historical Photograph Collection",1,0
