 




﻿"Item Id","Item URI","Dublin Core:Title","Dublin Core:Subject","Dublin Core:Description","Dublin Core:Creator","Dublin Core:Source","Dublin Core:Publisher","Dublin Core:Date","Dublin Core:Contributor","Dublin Core:Rights","Dublin Core:Relation","Dublin Core:Format","Dublin Core:Language","Dublin Core:Type","Dublin Core:Identifier","Dublin Core:Coverage","Item Type Metadata:Text","Item Type Metadata:Interviewer","Item Type Metadata:Interviewee","Item Type Metadata:Location","Item Type Metadata:Transcription","Item Type Metadata:Local URL","Item Type Metadata:Original Format","Item Type Metadata:Physical Dimensions","Item Type Metadata:Duration","Item Type Metadata:Compression","Item Type Metadata:Producer","Item Type Metadata:Director","Item Type Metadata:Bit Rate/Frequency","Item Type Metadata:Time Summary","Item Type Metadata:Email Body","Item Type Metadata:Subject Line","Item Type Metadata:From","Item Type Metadata:To","Item Type Metadata:CC","Item Type Metadata:BCC","Item Type Metadata:Number of Attachments","Item Type Metadata:Standards","Item Type Metadata:Objectives","Item Type Metadata:Materials","Item Type Metadata:Lesson Plan Text","Item Type Metadata:URL","Item Type Metadata:Event Type","Item Type Metadata:Participants","Item Type Metadata:Birth Date","Item Type Metadata:Birthplace","Item Type Metadata:Death Date","Item Type Metadata:Occupation","Item Type Metadata:Biographical Text","Item Type Metadata:Bibliography","Item Type Metadata:Digital Reproduction Information","Item Type Metadata:Repository","Item Type Metadata:Repository Collection","Item Type Metadata:Contact information.","Item Type Metadata:File Name","Item Type Metadata:Notes","Item Type Metadata:Digital item created","Item Type Metadata:Digital item modified","Item Type Metadata:Executive Orders","Item Type Metadata:Record Created","Item Type Metadata:Record Modified","Item Type Metadata:Transcription2","Item Type Metadata:Source URL","Omeka Legacy File:Additional Creator","Omeka Legacy File:Transcriber","Omeka Legacy File:Producer","Omeka Legacy File:Render Device","Omeka Legacy File:Render Details","Omeka Legacy File:Capture Date","Omeka Legacy File:Capture Device","Omeka Legacy File:Capture Details","Omeka Legacy File:Change History","Omeka Legacy File:Watermark","Omeka Legacy File:Encryption","Omeka Legacy File:Compression","Omeka Legacy File:Post Processing","Omeka Image File:Width","Omeka Image File:Height","Omeka Image File:Bit Depth","Omeka Image File:Channels","Omeka Image File:Exif String","Omeka Image File:Exif Array","Omeka Image File:IPTC String","Omeka Image File:IPTC Array","Omeka Video File:Bitrate","Omeka Video File:Duration","Omeka Video File:Sample Rate","Omeka Video File:Codec","Omeka Video File:Width","Omeka Video File:Height",tags,file,itemType,collection,public,featured
78957,https://www.iowaheritage.org/items/show/78957,"Oskaloosa Town Square Gathering, 1920's; Iowa","Oskaloosa|Iowa|Town Square|Early 20th Century|Politics|4th of July","This is a picture of the Oskaloosa town square/city park during the 1920's.  The gathering of so many at the city park could have been for a number of reasons, but the clues in this image indicate that it was a gathering for political purposes or to celebrate the 4th of July.  With stars and stripes on the float people are standing on, it is obvious that it was an occasion to celebrate.","Chuck Russell","Chuck Russell","Chuck Russell","""2009-06-10""",,www.wmpenn.edu/library/about.html,,"still image/jpeg 2000",,image,"www.wmpenn.edu/library/about.html|http://cdm16125.contentdm.oclc.org/u?/p270701coll6,224",,,,,,,,,,,,,,,,,,,,,,,,,,,,,,,,,,,,,,,,,,,,,,,,"<a href=""http://cdm16125.contentdm.oclc.org/u?/p270701coll6,224"" target=""_blank"">View this item in its source respository</a>",,,,,,,,,,,,,,,,,,,,,,,,,,,,,https://www.iowaheritage.org/files/original/23afe180ce245ef5077f74e2ac862cde.jpg,"Remote Item","Mahaska History",1,0
78464,https://www.iowaheritage.org/items/show/78464,"Picture sent to Congressman John F. Lacey of William Howard Taft in Fairfield, Iowa, 1908","Politics|Early 20th Century|John F. Lacey|President William Howard Taft|Republican Party|Mahaska County|Iowa","This is a picture sent to U.S. Congressman John F. Lacey of the 6th Iowa District of William Howard Taft campaigning for President of the United States on September 25, 1908, in Fairfield, Iowa.  Taft went on to win the Election of 1908.","Mahaska County Historical Society","Historical Archives","Mahaska County Historical Society",1908-09-25|2008-08-05,,www.nelsonpioneer.org,,"still image/jpeg",,image,"Mahaska County Historical Society|http://cdm16125.contentdm.oclc.org/u?/p270701coll7,124",,,,,,,,,,,,,,,,,,,,,,,,,,,,,,,,,,,,,,,,,,,,,,,,"<a href=""http://cdm16125.contentdm.oclc.org/u?/p270701coll7,124"" target=""_blank"">View this item in its source respository</a>",,,,,,,,,,,,,,,,,,,,,,,,,,,,,https://www.iowaheritage.org/files/original/0c91271af0adf858d159c643379ce01b.jpg,"Remote Item","Mahaska County Historical Society",1,0
64715,https://www.iowaheritage.org/items/show/64715,"Made in Iowa","Campaigns|Branstad, Terry E.|Iowa|Recreational vehicles|1990-2000|Campaigning|Politics|Politicians|Governors|Men|Chickens|Helmets|Megaphones","Truth in Iowa","Duffy, Brian, 1955-",,"University of Iowa. Libraries. Special Collections Dept.",1999-05-31|2011-04,,"Educational use only, no other permissions given. Copyright to this digital object is owned by The Des Moines Register; it may not be downloaded, reproduced, or distributed without written permission. For more information, contact the Special Collections Department.","Editorial Cartoons of Brian Duffy; Des Moines Register Cartoonists|Papers of Brian Duffy|Des Moines Register",,English,"Still image|Editorial cartoons",MSC916|duffy-990531|http://digital.lib.uiowa.edu/cdm/ref/collection/duffy/id/553,,,,,,,,,,,,,,,,,,,,,,,,,,,,,,,,,,,,,,,,,,,,,,,,"<a href=""http://digital.lib.uiowa.edu/cdm/ref/collection/duffy/id/553"" target=""_blank"">View this item in its source respository</a>",,,,,,,,,,,,,,,,,,,,,,,,,,,,,https://www.iowaheritage.org/files/original/0b76cb2b1e516274b9b3054d205888e5.jpg,"Remote Item","Editorial Cartoons of Brian Duffy",1,0
64710,https://www.iowaheritage.org/items/show/64710,"It's George Bush ... he doesn't want to leave his state, and was wondering if we could hold the Iowa caucuses in Texas?","Caucus|Bush, George W. (George Walker), 1946-|Iowa|Men|1990-2000|Political parties|Politics|Politicians|Candidates|Campaigning|Campaigns|Women|Offices|Telephones|Computers|Desks|Maps","Y2Quayle; Pat!!!; Forbes 2000 flat; Iowa Republican Party headquarters","Duffy, Brian, 1955-",,"University of Iowa. Libraries. Special Collections Dept.",1999-05-21|2011-04,,"Educational use only, no other permissions given. Copyright to this digital object is owned by The Des Moines Register; it may not be downloaded, reproduced, or distributed without written permission. For more information, contact the Special Collections Department.","Editorial Cartoons of Brian Duffy; Des Moines Register Cartoonists|Papers of Brian Duffy|Des Moines Register",,English,"Still image|Editorial cartoons",MSC916|duffy-990521|http://digital.lib.uiowa.edu/cdm/ref/collection/duffy/id/548,,,,,,,,,,,,,,,,,,,,,,,,,,,,,,,,,,,,,,,,,,,,,,,,"<a href=""http://digital.lib.uiowa.edu/cdm/ref/collection/duffy/id/548"" target=""_blank"">View this item in its source respository</a>",,,,,,,,,,,,,,,,,,,,,,,,,,,,,https://www.iowaheritage.org/files/original/4a1c6fbc02e180a3c3f0c871a5bcf17c.jpg,"Remote Item","Editorial Cartoons of Brian Duffy",1,0
64707,https://www.iowaheritage.org/items/show/64707,"Bean ball","City government|Iowa|Baseball players|1990-2000|Sports|Baseball|Politics|Baseball gloves|Baseball bats|Baseballs|Stars","I-Cub sale threat; City council","Duffy, Brian, 1955-",,"University of Iowa. Libraries. Special Collections Dept.",1999-05-28|2011-04,,"Educational use only, no other permissions given. Copyright to this digital object is owned by The Des Moines Register; it may not be downloaded, reproduced, or distributed without written permission. For more information, contact the Special Collections Department.","Editorial Cartoons of Brian Duffy; Des Moines Register Cartoonists|Papers of Brian Duffy|Des Moines Register",,English,"Still image|Editorial cartoons",MSC916|duffy-990528|http://digital.lib.uiowa.edu/cdm/ref/collection/duffy/id/545,,,,,,,,,,,,,,,,,,,,,,,,,,,,,,,,,,,,,,,,,,,,,,,,"<a href=""http://digital.lib.uiowa.edu/cdm/ref/collection/duffy/id/545"" target=""_blank"">View this item in its source respository</a>",,,,,,,,,,,,,,,,,,,,,,,,,,,,,https://www.iowaheritage.org/files/original/825c34bf87102761b2df7d607282a496.jpg,"Remote Item","Editorial Cartoons of Brian Duffy",1,0
64694,https://www.iowaheritage.org/items/show/64694,"Fight's over, it's their handler's turn now","Elections -- United States|Clinton, Bill, 1946|United States|Presidents -- United States -- Election -- 1996|Boxing|1990-2000|Elections|Politicians|Politics|Presidency|Presidents -- United States|Campaigning|Dole, Robert J., 1923-|Boxing rings|Journalists|Dust clouds|Stars|Buckets|Horseshoes","Our guy beat the snot our of yer guy!; He never laid a hand on 'im!; Dole; Clinton; Spin doctors","Duffy, Brian, 1955-",,"University of Iowa. Libraries. Special Collections Dept.",1996-10-18|2011-04,,"Educational use only, no other permissions given. Copyright to this digital object is owned by The Des Moines Register; it may not be downloaded, reproduced, or distributed without written permission. For more information, contact the Special Collections Department.","Editorial Cartoons of Brian Duffy; Des Moines Register Cartoonists|Papers of Brian Duffy|Des Moines Register",,English,"Still image|Editorial cartoons",MSC916|duffy-961018|http://digital.lib.uiowa.edu/cdm/ref/collection/duffy/id/532,,,,,,,,,,,,,,,,,,,,,,,,,,,,,,,,,,,,,,,,,,,,,,,,"<a href=""http://digital.lib.uiowa.edu/cdm/ref/collection/duffy/id/532"" target=""_blank"">View this item in its source respository</a>",,,,,,,,,,,,,,,,,,,,,,,,,,,,,https://www.iowaheritage.org/files/original/2744094207c629926b83dabf97a10b8e.jpg,"Remote Item","Editorial Cartoons of Brian Duffy",1,0
64690,https://www.iowaheritage.org/items/show/64690,"One last touch up","Elections -- United States|Clinton, Bill, 1946|United States|Presidents -- United States -- Election -- 1996|Debates|1990-2000|Elections|Politicians|Politics|Presidency|Presidents -- United States|Debate|Candidates|Dole, Robert J., 1923-|Candidates|Hair|Hairdressing|Podiums|Stages|Men|Microphones","Teflon; In 5 ... 4 ... 3 ... 2 ...","Duffy, Brian, 1955-",,"University of Iowa. Libraries. Special Collections Dept.",1996-10-08|2011-04,,"Educational use only, no other permissions given. Copyright to this digital object is owned by The Des Moines Register; it may not be downloaded, reproduced, or distributed without written permission. For more information, contact the Special Collections Department.","Editorial Cartoons of Brian Duffy; Des Moines Register Cartoonists|Papers of Brian Duffy|Des Moines Register",,English,"Still image|Editorial cartoons",MSC916|duffy-961008|http://digital.lib.uiowa.edu/cdm/ref/collection/duffy/id/528,,,,,,,,,,,,,,,,,,,,,,,,,,,,,,,,,,,,,,,,,,,,,,,,"<a href=""http://digital.lib.uiowa.edu/cdm/ref/collection/duffy/id/528"" target=""_blank"">View this item in its source respository</a>",,,,,,,,,,,,,,,,,,,,,,,,,,,,,https://www.iowaheritage.org/files/original/fd2a9aff8a23b75063f85dacb0da3dc6.jpg,"Remote Item","Editorial Cartoons of Brian Duffy",1,0
64688,https://www.iowaheritage.org/items/show/64688,Pig!,"Elections -- United States|Clinton, Bill, 1946|United States|Presidents -- United States -- Election -- 1996|Pigs|1990-2000|Elections|Politicians|Politics|Presidency|Presidents -- United States|Candidates|Campaign contributions|Campaign funding|Dole, Robert J., 1923-|Mud|Fences","Takes one to know one; Campaign contributions","Duffy, Brian, 1955-",,"University of Iowa. Libraries. Special Collections Dept.",1996-10-23|2011-04,,"Educational use only, no other permissions given. Copyright to this digital object is owned by The Des Moines Register; it may not be downloaded, reproduced, or distributed without written permission. For more information, contact the Special Collections Department.","Editorial Cartoons of Brian Duffy; Des Moines Register Cartoonists|Papers of Brian Duffy|Des Moines Register",,English,"Still image|Editorial cartoons",MSC916|duffy-961023|http://digital.lib.uiowa.edu/cdm/ref/collection/duffy/id/526,,,,,,,,,,,,,,,,,,,,,,,,,,,,,,,,,,,,,,,,,,,,,,,,"<a href=""http://digital.lib.uiowa.edu/cdm/ref/collection/duffy/id/526"" target=""_blank"">View this item in its source respository</a>",,,,,,,,,,,,,,,,,,,,,,,,,,,,,https://www.iowaheritage.org/files/original/003ac58575dee7ec28b8d38fa4d607d0.jpg,"Remote Item","Editorial Cartoons of Brian Duffy",1,0
64684,https://www.iowaheritage.org/items/show/64684,"Buzz buzz","Taxes|Branstad, Terry E.|Iowa|Trees|1990-2000|Tax relief|Tax reduction|Governors|Government|Legislature|Politics|Politicians|Political parties|Political promises|Woodcutting|Woodcutters|Hats|Men|Saws","Taxes; Senate Democrats","Duffy, Brian, 1955-",,"University of Iowa. Libraries. Special Collections Dept.",1996-10-06|2011-04,,"Educational use only, no other permissions given. Copyright to this digital object is owned by The Des Moines Register; it may not be downloaded, reproduced, or distributed without written permission. For more information, contact the Special Collections Department.","Editorial Cartoons of Brian Duffy; Des Moines Register Cartoonists|Papers of Brian Duffy|Des Moines Register",,English,"Still image|Editorial cartoons",MSC916|duffy-961006|http://digital.lib.uiowa.edu/cdm/ref/collection/duffy/id/522,,,,,,,,,,,,,,,,,,,,,,,,,,,,,,,,,,,,,,,,,,,,,,,,"<a href=""http://digital.lib.uiowa.edu/cdm/ref/collection/duffy/id/522"" target=""_blank"">View this item in its source respository</a>",,,,,,,,,,,,,,,,,,,,,,,,,,,,,https://www.iowaheritage.org/files/original/53ceb4e823ccb214d9f7218bd902d1e7.jpg,"Remote Item","Editorial Cartoons of Brian Duffy",1,0
64683,https://www.iowaheritage.org/items/show/64683,"Bob Dole looking at old hatchet","Politics|Dole, Robert J., 1923-|United States|Tree stumps|1990-2000|Politicians|Political ambition|Campaigns|Campaigning|Candidates|Trees|Leaves|Hatchets|Cobwebs|Spiders|Men",,"Duffy, Brian, 1955-",,"University of Iowa. Libraries. Special Collections Dept.",1996-10-15|2011-04,,"Educational use only, no other permissions given. Copyright to this digital object is owned by The Des Moines Register; it may not be downloaded, reproduced, or distributed without written permission. For more information, contact the Special Collections Department.","Editorial Cartoons of Brian Duffy; Des Moines Register Cartoonists|Papers of Brian Duffy|Des Moines Register",,English,"Still image|Editorial cartoons",MSC916|duffy-961015|http://digital.lib.uiowa.edu/cdm/ref/collection/duffy/id/521,,,,,,,,,,,,,,,,,,,,,,,,,,,,,,,,,,,,,,,,,,,,,,,,"<a href=""http://digital.lib.uiowa.edu/cdm/ref/collection/duffy/id/521"" target=""_blank"">View this item in its source respository</a>",,,,,,,,,,,,,,,,,,,,,,,,,,,,,https://www.iowaheritage.org/files/original/6f9e6c9446f08d08fe8ec6503ed0bcd7.jpg,"Remote Item","Editorial Cartoons of Brian Duffy",1,0
