 




﻿"Item Id","Item URI","Dublin Core:Title","Dublin Core:Subject","Dublin Core:Description","Dublin Core:Creator","Dublin Core:Source","Dublin Core:Publisher","Dublin Core:Date","Dublin Core:Contributor","Dublin Core:Rights","Dublin Core:Relation","Dublin Core:Format","Dublin Core:Language","Dublin Core:Type","Dublin Core:Identifier","Dublin Core:Coverage","Item Type Metadata:Text","Item Type Metadata:Interviewer","Item Type Metadata:Interviewee","Item Type Metadata:Location","Item Type Metadata:Transcription","Item Type Metadata:Local URL","Item Type Metadata:Original Format","Item Type Metadata:Physical Dimensions","Item Type Metadata:Duration","Item Type Metadata:Compression","Item Type Metadata:Producer","Item Type Metadata:Director","Item Type Metadata:Bit Rate/Frequency","Item Type Metadata:Time Summary","Item Type Metadata:Email Body","Item Type Metadata:Subject Line","Item Type Metadata:From","Item Type Metadata:To","Item Type Metadata:CC","Item Type Metadata:BCC","Item Type Metadata:Number of Attachments","Item Type Metadata:Standards","Item Type Metadata:Objectives","Item Type Metadata:Materials","Item Type Metadata:Lesson Plan Text","Item Type Metadata:URL","Item Type Metadata:Event Type","Item Type Metadata:Participants","Item Type Metadata:Birth Date","Item Type Metadata:Birthplace","Item Type Metadata:Death Date","Item Type Metadata:Occupation","Item Type Metadata:Biographical Text","Item Type Metadata:Bibliography","Item Type Metadata:Digital Reproduction Information","Item Type Metadata:Repository","Item Type Metadata:Repository Collection","Item Type Metadata:Contact information.","Item Type Metadata:File Name","Item Type Metadata:Notes","Item Type Metadata:Digital item created","Item Type Metadata:Digital item modified","Item Type Metadata:Executive Orders","Item Type Metadata:Record Created","Item Type Metadata:Record Modified","Item Type Metadata:Transcription2","Item Type Metadata:Source URL","Omeka Legacy File:Additional Creator","Omeka Legacy File:Transcriber","Omeka Legacy File:Producer","Omeka Legacy File:Render Device","Omeka Legacy File:Render Details","Omeka Legacy File:Capture Date","Omeka Legacy File:Capture Device","Omeka Legacy File:Capture Details","Omeka Legacy File:Change History","Omeka Legacy File:Watermark","Omeka Legacy File:Encryption","Omeka Legacy File:Compression","Omeka Legacy File:Post Processing","Omeka Image File:Width","Omeka Image File:Height","Omeka Image File:Bit Depth","Omeka Image File:Channels","Omeka Image File:Exif String","Omeka Image File:Exif Array","Omeka Image File:IPTC String","Omeka Image File:IPTC Array","Omeka Video File:Bitrate","Omeka Video File:Duration","Omeka Video File:Sample Rate","Omeka Video File:Codec","Omeka Video File:Width","Omeka Video File:Height",tags,file,itemType,collection,public,featured
22420,https://www.iowaheritage.org/items/show/22420,"Centennial birthday cake, Centennial Dinner, Iowa Memorial Union, University of Iowa, February 25, 1947","Cakes|University of Iowa|United States -- Iowa -- Iowa City|1940-1950|Candles|Centennial celebrations|Universities & colleges|Iowa Memorial Union (Iowa City, Iowa)|Old Capitol (Iowa City, Iowa)",,"Kent, Frederick W. (Frederick Wallace), 1894-1984",,"The University of Iowa. Libraries. University Archives",1947-02-25|2008-05-20,,"Educational use only, no other permissions given. U.S. and international copyright laws may protect this digital object. Commercial use or distribution of the object is not permitted without prior permission of the copyright holder.","Iowa City Town and Campus Scenes|Frederick W. Kent collection of photographs, 1866-2000|http://www.lib.uiowa.edu/collguides/?RG30.0001.01|Prints|Events and activities|Centennial Dinner|Centennial Dinner|Scanned with Ricoh Aficio 3228C at 600 ppi, full color. Master images saved in tiff format.",20|25,,"Still image|Photographs|jpeg",RG30.0001.01|https://digital.lib.uiowa.edu/,,,,,,,,,,,,,,,,,,,,,,,,,,,,,,,,,,,,,,,,,,,,,,,,"<a href=""https://digital.lib.uiowa.edu/"" target=""_blank"">View this item in its source respository</a>",,,,,,,,,,,,,,,,,,,,,,,,,,,,,https://www.iowaheritage.org/files/original/bd95d1743704c639e3d917b513aa1f52.jpg,"Remote Item","Iowa City Town and Campus Scenes",1,0
22422,https://www.iowaheritage.org/items/show/22422,"Kitchen workers preparing food for Centennial Dinner, Iowa Memorial Union, The University of Iowa, February 25, 1947","Cooks|Plates (Tableware)|University of Iowa|United States -- Iowa -- Iowa City|1940-1950|Tableware|Food|Centennial celebrations|Universities & colleges|Dinners and dining|Iowa Memorial Union (Iowa City, Iowa)",,"Kent, Frederick W. (Frederick Wallace), 1894-1984",,"The University of Iowa. Libraries. University Archives",1947-02-25|2008-05-20,,"Educational use only, no other permissions given. U.S. and international copyright laws may protect this digital object. Commercial use or distribution of the object is not permitted without prior permission of the copyright holder.","Iowa City Town and Campus Scenes|Frederick W. Kent collection of photographs, 1866-2000|http://www.lib.uiowa.edu/collguides/?RG30.0001.01|Prints|Events and activities|Centennial Dinner|Centennial Dinner|Scanned with Ricoh Aficio 3228C at 600 ppi, full color. Master images saved in tiff format.",20|25,,"Still image|Photographs|jpeg",RG30.0001.01|https://digital.lib.uiowa.edu/,,,,,,,,,,,,,,,,,,,,,,,,,,,,,,,,,,,,,,,,,,,,,,,,"<a href=""https://digital.lib.uiowa.edu/"" target=""_blank"">View this item in its source respository</a>",,,,,,,,,,,,,,,,,,,,,,,,,,,,,https://www.iowaheritage.org/files/original/676058e43bcc28ffda2ba6576344327a.jpg,"Remote Item","Iowa City Town and Campus Scenes",1,0
22424,https://www.iowaheritage.org/items/show/22424,"Old Capitol table centerpiece next to candelabra at Centennial Dinner, Iowa Memorial Union, University of Iowa, February 25, 1947","Table settings & decorations|University of Iowa|United States -- Iowa -- Iowa City|1940-1950|Candelabras|Centennial celebrations|Universities & colleges|Iowa Memorial Union (Iowa City, Iowa)",,"Kent, Frederick W. (Frederick Wallace), 1894-1984",,"The University of Iowa. Libraries. University Archives",1947-02-25|2008-05-20,,"Educational use only, no other permissions given. U.S. and international copyright laws may protect this digital object. Commercial use or distribution of the object is not permitted without prior permission of the copyright holder.","Iowa City Town and Campus Scenes|Frederick W. Kent collection of photographs, 1866-2000|http://www.lib.uiowa.edu/collguides/?RG30.0001.01|Prints|Events and activities|Centennial Dinner|Centennial Dinner|Scanned with Ricoh Aficio 3228C at 600 ppi, full color. Master images saved in tiff format.",20|25,,"Still image|Photographs|jpeg",RG30.0001.01|https://digital.lib.uiowa.edu/,,,,,,,,,,,,,,,,,,,,,,,,,,,,,,,,,,,,,,,,,,,,,,,,"<a href=""https://digital.lib.uiowa.edu/"" target=""_blank"">View this item in its source respository</a>",,,,,,,,,,,,,,,,,,,,,,,,,,,,,https://www.iowaheritage.org/files/original/29ebc3aa9cbb9644cfbc458956c025af.jpg,"Remote Item","Iowa City Town and Campus Scenes",1,0
22425,https://www.iowaheritage.org/items/show/22425,"Tables set for Centennial Dinner, Iowa Memorial Union, University of Iowa, February 25, 1947","Centennial celebrations|Dinners and dining|University of Iowa|United States -- Iowa -- Iowa City|1940-1950|Table settings & decorations|Universities & colleges|Iowa Memorial Union (Iowa City, Iowa)",,"Kent, Frederick W. (Frederick Wallace), 1894-1984",,"The University of Iowa. Libraries. University Archives",1947-02-25|2008-05-20,,"Educational use only, no other permissions given. U.S. and international copyright laws may protect this digital object. Commercial use or distribution of the object is not permitted without prior permission of the copyright holder.","Iowa City Town and Campus Scenes|Frederick W. Kent collection of photographs, 1866-2000|http://www.lib.uiowa.edu/collguides/?RG30.0001.01|Prints|Events and activities|Centennial Dinner|Centennial Dinner|Scanned with Ricoh Aficio 3228C at 600 ppi, full color. Master images saved in tiff format.",20|25,,"Still image|Photographs|jpeg",RG30.0001.01|https://digital.lib.uiowa.edu/,,,,,,,,,,,,,,,,,,,,,,,,,,,,,,,,,,,,,,,,,,,,,,,,"<a href=""https://digital.lib.uiowa.edu/"" target=""_blank"">View this item in its source respository</a>",,,,,,,,,,,,,,,,,,,,,,,,,,,,,https://www.iowaheritage.org/files/original/6f45a29f1a37cf11ebd1ab0e056cef5b.jpg,"Remote Item","Iowa City Town and Campus Scenes",1,0
22427,https://www.iowaheritage.org/items/show/22427,"Waiters carrying cake at Centennial Dinner, Iowa Memorial Union, University of Iowa, February 25, 1947","Waiters|University of Iowa|United States -- Iowa -- Iowa City|1940-1950|Cakes|Candles|Centennial celebrations|Universities & colleges|Iowa Memorial Union (Iowa City, Iowa)",,"Kent, Frederick W. (Frederick Wallace), 1894-1984",,"The University of Iowa. Libraries. University Archives",1947-02-25|2008-05-20,,"Educational use only, no other permissions given. U.S. and international copyright laws may protect this digital object. Commercial use or distribution of the object is not permitted without prior permission of the copyright holder.","Iowa City Town and Campus Scenes|Frederick W. Kent collection of photographs, 1866-2000|http://www.lib.uiowa.edu/collguides/?RG30.0001.01|Prints|Events and activities|Centennial Dinner|Centennial Dinner|Scanned with Ricoh Aficio 3228C at 600 ppi, full color. Master images saved in tiff format.",20|25,,"Still image|Photographs|jpeg",RG30.0001.01|https://digital.lib.uiowa.edu/,,,,,,,,,,,,,,,,,,,,,,,,,,,,,,,,,,,,,,,,,,,,,,,,"<a href=""https://digital.lib.uiowa.edu/"" target=""_blank"">View this item in its source respository</a>",,,,,,,,,,,,,,,,,,,,,,,,,,,,,https://www.iowaheritage.org/files/original/07441d9e1cab9bd63e1391b42e7cebb1.jpg,"Remote Item","Iowa City Town and Campus Scenes",1,0
22429,https://www.iowaheritage.org/items/show/22429,"Old Capitol centerpiece at Centennial Dinner, Iowa Memorial Union, University of Iowa, February 25, 1947","Table settings & decorations|University of Iowa|United States -- Iowa -- Iowa City|1940-1950|Centennial celebrations|Universities & colleges|Iowa Memorial Union (Iowa City, Iowa)|Old Capitol (Iowa City, Iowa)",,"Kent, Frederick W. (Frederick Wallace), 1894-1984",,"The University of Iowa. Libraries. University Archives",1947-02-25|2008-05-20,,"Educational use only, no other permissions given. U.S. and international copyright laws may protect this digital object. Commercial use or distribution of the object is not permitted without prior permission of the copyright holder.","Iowa City Town and Campus Scenes|Frederick W. Kent collection of photographs, 1866-2000|http://www.lib.uiowa.edu/collguides/?RG30.0001.01|Prints|Events and activities|Centennial Dinner|Centennial Dinner|Scanned with Ricoh Aficio 3228C at 600 ppi, full color. Master images saved in tiff format.",20|25,,"Still image|Photographs|jpeg",RG30.0001.01|https://digital.lib.uiowa.edu/,,,,,,,,,,,,,,,,,,,,,,,,,,,,,,,,,,,,,,,,,,,,,,,,"<a href=""https://digital.lib.uiowa.edu/"" target=""_blank"">View this item in its source respository</a>",,,,,,,,,,,,,,,,,,,,,,,,,,,,,https://www.iowaheritage.org/files/original/311c6bbe4b1fc7a54e8e55c96a80dfb1.jpg,"Remote Item","Iowa City Town and Campus Scenes",1,0
22431,https://www.iowaheritage.org/items/show/22431,"Waitresses with dessert cups, Centennial Dinner, Iowa Memorial Union, University of Iowa, February 25, 1947","Waitresses|Desserts|University of Iowa|United States -- Iowa -- Iowa City|1940-1950|Tableware|Women|Centennial celebrations|Universities & colleges|Dinners and dining|Iowa Memorial Union (Iowa City, Iowa)",,"Kent, Frederick W. (Frederick Wallace), 1894-1984",,"The University of Iowa. Libraries. University Archives",1947-02-25|2008-05-20,,"Educational use only, no other permissions given. U.S. and international copyright laws may protect this digital object. Commercial use or distribution of the object is not permitted without prior permission of the copyright holder.","Iowa City Town and Campus Scenes|Frederick W. Kent collection of photographs, 1866-2000|http://www.lib.uiowa.edu/collguides/?RG30.0001.01|Prints|Events and activities|Centennial Dinner|Centennial Dinner|Scanned with Ricoh Aficio 3228C at 600 ppi, full color. Master images saved in tiff format.",25|20,,"Still image|Photographs|jpeg",RG30.0001.01|https://digital.lib.uiowa.edu/,,,,,,,,,,,,,,,,,,,,,,,,,,,,,,,,,,,,,,,,,,,,,,,,"<a href=""https://digital.lib.uiowa.edu/"" target=""_blank"">View this item in its source respository</a>",,,,,,,,,,,,,,,,,,,,,,,,,,,,,https://www.iowaheritage.org/files/original/4df3443d2e79faf3830e2aab8d9fec4f.jpg,"Remote Item","Iowa City Town and Campus Scenes",1,0
22433,https://www.iowaheritage.org/items/show/22433,"Tables set for Centennial Dinner, Iowa Memorial Union, University of Iowa, February 25, 1947","Table settings & decorations|Dinners and dining|University of Iowa|United States -- Iowa -- Iowa City|1940-1950|Dining rooms|Centennial celebrations|Universities & colleges|Iowa Memorial Union (Iowa City, Iowa)",,"Kent, Frederick W. (Frederick Wallace), 1894-1984",,"The University of Iowa. Libraries. University Archives",1947-02-25|2008-05-20,,"Educational use only, no other permissions given. U.S. and international copyright laws may protect this digital object. Commercial use or distribution of the object is not permitted without prior permission of the copyright holder.","Iowa City Town and Campus Scenes|Frederick W. Kent collection of photographs, 1866-2000|http://www.lib.uiowa.edu/collguides/?RG30.0001.01|Prints|Events and activities|Centennial Dinner|Centennial Dinner|Scanned with Ricoh Aficio 3228C at 600 ppi, full color. Master images saved in tiff format.",20|25,,"Still image|Photographs|jpeg",RG30.0001.01|https://digital.lib.uiowa.edu/,,,,,,,,,,,,,,,,,,,,,,,,,,,,,,,,,,,,,,,,,,,,,,,,"<a href=""https://digital.lib.uiowa.edu/"" target=""_blank"">View this item in its source respository</a>",,,,,,,,,,,,,,,,,,,,,,,,,,,,,https://www.iowaheritage.org/files/original/d28aaf4b737beca907f820b00c3c1d3c.jpg,"Remote Item","Iowa City Town and Campus Scenes",1,0
22435,https://www.iowaheritage.org/items/show/22435,"Chorus at Centennial Dinner, Iowa Memorial Union, University of Iowa, February 25, 1947","Centennial celebrations|Hervig, Richard|University of Iowa|United States -- Iowa -- Iowa City|1940-1950|Choirs (Music)|Singing|Men|Women|Universities & colleges|Schuffman, Dan|Karel, Leon C.|Iowa Memorial Union (Iowa City, Iowa)","Richard Hervig became a faculty member at the University's School of Music.","Kent, Frederick W. (Frederick Wallace), 1894-1984",,"The University of Iowa. Libraries. University Archives",1947-02-25|2008-05-20,,"Educational use only, no other permissions given. U.S. and international copyright laws may protect this digital object. Commercial use or distribution of the object is not permitted without prior permission of the copyright holder.","Iowa City Town and Campus Scenes|Frederick W. Kent collection of photographs, 1866-2000|http://www.lib.uiowa.edu/collguides/?RG30.0001.01|Prints|Events and activities|Centennial Dinner|Centennial Dinner|Scanned with Ricoh Aficio 3228C at 600 ppi, full color. Master images saved in tiff format.",20|25,,"Still image|Photographs|jpeg",RG30.0001.01|https://digital.lib.uiowa.edu/,,,,,,,,,,,,,,,,,,,,,,,,,,,,,,,,,,,,,,,,,,,,,,,,"<a href=""https://digital.lib.uiowa.edu/"" target=""_blank"">View this item in its source respository</a>",,,,,,,,,,,,,,,,,,,,,,,,,,,,,https://www.iowaheritage.org/files/original/05ed69a98e5d4d4f35edb02bcfb2a026.jpg,"Remote Item","Iowa City Town and Campus Scenes",1,0
22437,https://www.iowaheritage.org/items/show/22437,"Men in uniform at Centennial Dinner, Iowa Memorial Union, The University of Iowa, February 25, 1947","Centennial celebrations|Dinners and dining|University of Iowa|United States -- Iowa -- Iowa City|1940-1950|Table settings & decorations|Men|Uniforms|Waiters|Universities & colleges|Iowa Memorial Union (Iowa City, Iowa)",,"Kent, Frederick W. (Frederick Wallace), 1894-1984",,"The University of Iowa. Libraries. University Archives",1947-02-25|2008-05-20,,"Educational use only, no other permissions given. U.S. and international copyright laws may protect this digital object. Commercial use or distribution of the object is not permitted without prior permission of the copyright holder.","Iowa City Town and Campus Scenes|Frederick W. Kent collection of photographs, 1866-2000|http://www.lib.uiowa.edu/collguides/?RG30.0001.01|Prints|Events and activities|Centennial Dinner|Centennial Dinner|Scanned with Ricoh Aficio 3228C at 600 ppi, full color. Master images saved in tiff format.",20|25,,"Still image|Photographs|jpeg",RG30.0001.01|https://digital.lib.uiowa.edu/,,,,,,,,,,,,,,,,,,,,,,,,,,,,,,,,,,,,,,,,,,,,,,,,"<a href=""https://digital.lib.uiowa.edu/"" target=""_blank"">View this item in its source respository</a>",,,,,,,,,,,,,,,,,,,,,,,,,,,,,https://www.iowaheritage.org/files/original/bda1fcb68865e421fef1c33ddf2879f7.jpg,"Remote Item","Iowa City Town and Campus Scenes",1,0
