 




﻿"Item Id","Item URI","Dublin Core:Title","Dublin Core:Subject","Dublin Core:Description","Dublin Core:Creator","Dublin Core:Source","Dublin Core:Publisher","Dublin Core:Date","Dublin Core:Contributor","Dublin Core:Rights","Dublin Core:Relation","Dublin Core:Format","Dublin Core:Language","Dublin Core:Type","Dublin Core:Identifier","Dublin Core:Coverage","Item Type Metadata:Text","Item Type Metadata:Interviewer","Item Type Metadata:Interviewee","Item Type Metadata:Location","Item Type Metadata:Transcription","Item Type Metadata:Local URL","Item Type Metadata:Original Format","Item Type Metadata:Physical Dimensions","Item Type Metadata:Duration","Item Type Metadata:Compression","Item Type Metadata:Producer","Item Type Metadata:Director","Item Type Metadata:Bit Rate/Frequency","Item Type Metadata:Time Summary","Item Type Metadata:Email Body","Item Type Metadata:Subject Line","Item Type Metadata:From","Item Type Metadata:To","Item Type Metadata:CC","Item Type Metadata:BCC","Item Type Metadata:Number of Attachments","Item Type Metadata:Standards","Item Type Metadata:Objectives","Item Type Metadata:Materials","Item Type Metadata:Lesson Plan Text","Item Type Metadata:URL","Item Type Metadata:Event Type","Item Type Metadata:Participants","Item Type Metadata:Birth Date","Item Type Metadata:Birthplace","Item Type Metadata:Death Date","Item Type Metadata:Occupation","Item Type Metadata:Biographical Text","Item Type Metadata:Bibliography","Item Type Metadata:Digital Reproduction Information","Item Type Metadata:Repository","Item Type Metadata:Repository Collection","Item Type Metadata:Contact information.","Item Type Metadata:File Name","Item Type Metadata:Notes","Item Type Metadata:Digital item created","Item Type Metadata:Digital item modified","Item Type Metadata:Executive Orders","Item Type Metadata:Record Created","Item Type Metadata:Record Modified","Item Type Metadata:Transcription2","Item Type Metadata:Source URL","Omeka Legacy File:Additional Creator","Omeka Legacy File:Transcriber","Omeka Legacy File:Producer","Omeka Legacy File:Render Device","Omeka Legacy File:Render Details","Omeka Legacy File:Capture Date","Omeka Legacy File:Capture Device","Omeka Legacy File:Capture Details","Omeka Legacy File:Change History","Omeka Legacy File:Watermark","Omeka Legacy File:Encryption","Omeka Legacy File:Compression","Omeka Legacy File:Post Processing","Omeka Image File:Width","Omeka Image File:Height","Omeka Image File:Bit Depth","Omeka Image File:Channels","Omeka Image File:Exif String","Omeka Image File:Exif Array","Omeka Image File:IPTC String","Omeka Image File:IPTC Array","Omeka Video File:Bitrate","Omeka Video File:Duration","Omeka Video File:Sample Rate","Omeka Video File:Codec","Omeka Video File:Width","Omeka Video File:Height",tags,file,itemType,collection,public,featured
15287,https://www.iowaheritage.org/items/show/15287,"Maquoketa River and pine covered bluffs on the west side of ""Devil's Backbone"", Dundee, Iowa, late 1890s or early 1900s","Geology|Maquoketa River (Iowa)|United States -- Iowa -- Delaware County -- Dundee|190-|Paleozoic -- Silurian|Niagaran limestone|Rivers|Cliffs",,"Calvin, S. (Samuel), 1840-1911","Photographs scanned using Epson Expression 1680 scanner at 300 ppi, 8-bit greyscale.","University of Iowa. Dept. of Geoscience. Paleontology Repository|Contact Tiffany Adrain (tiffany-adrain@uiowa.edu) at The University of Iowa Paleontology Repository http://www.uiowa.edu/~geology/paleo",1895/1910|2006-02-24,,"This digital image may be used for educational purposes, as long as it is not altered in any way. No commercial reproduction or distribution of this file is permitted without permission.","Calvin Geological Photographs|This digital collection contains the geology-related images originally digitized for the Dept. of Geosciences' Calvin web exhibit: http://www.uiowa.edu/~calvin/calvin.htm . Calvin's images of Iowa City can be viewed in the Iowa City Town and Campus Scenes Digital Collection: http://digital.lib.uiowa.edu/ictcs",jpeg|5|7,,"Still image|Photographs; Dry collodion negatives",166|1511|173611416|https://digital.lib.uiowa.edu/,,,,,,,,,,,,,,,,,,,,,,,,,,,,,,,,,,,,,,,,,,,,,,,,"<a href=""https://digital.lib.uiowa.edu/"" target=""_blank"">View this item in its source respository</a>",,,,,,,,,,,,,,,,,,,,,,,,,,,,,https://www.iowaheritage.org/files/original/6f1c45351ef8019694d0d13f09faeebf.jpg,"Remote Item","Calvin Geological Photographs",1,0
15283,https://www.iowaheritage.org/items/show/15283,"Beds of passage, Iowa, late 1890s or early 1900s","Geology|United States -- Iowa -- Delaware County|190-|Paleozoic -- Silurian|Niagaran Limestone|Maquoketa Shale","Section 10, Twp. 90 R. 4,","Calvin, S. (Samuel), 1840-1911","Photographs scanned using Epson Expression 1680 scanner at 300 ppi, 8-bit greyscale.","University of Iowa. Dept. of Geoscience. Paleontology Repository|Contact Tiffany Adrain (tiffany-adrain@uiowa.edu) at The University of Iowa Paleontology Repository http://www.uiowa.edu/~geology/paleo",1895/1910|2006-20-02,,"This digital image may be used for educational purposes, as long as it is not altered in any way. No commercial reproduction or distribution of this file is permitted without permission.","Calvin Geological Photographs|This digital collection contains the geology-related images originally digitized for the Dept. of Geosciences' Calvin web exhibit: http://www.uiowa.edu/~calvin/calvin.htm . Calvin's images of Iowa City can be viewed in the Iowa City Town and Campus Scenes Digital Collection: http://digital.lib.uiowa.edu/ictcs",jpeg|5|7,,"Still image|Photographs",0159|173611416|https://digital.lib.uiowa.edu/,,,,,,,,,,,,,,,,,,,,,,,,,,,,,,,,,,,,,,,,,,,,,,,,"<a href=""https://digital.lib.uiowa.edu/"" target=""_blank"">View this item in its source respository</a>",,,,,,,,,,,,,,,,,,,,,,,,,,,,,https://www.iowaheritage.org/files/original/98ab7e6942aa1eec499e54ce58d5a55c.jpg,"Remote Item","Calvin Geological Photographs",1,0
15282,https://www.iowaheritage.org/items/show/15282,"Beds of passage, Iowa, late 1890s or early 1900s","Geology|United States -- Iowa -- Delaware County|190-|Paleozoic -- Silurian|Niagaran Limestone|Maquoketa Shale","Twp. 90. R. VI, Section 10","Calvin, S. (Samuel), 1840-1911","Photographs scanned using Epson Expression 1680 scanner at 300 ppi, 8-bit greyscale.","University of Iowa. Dept. of Geoscience. Paleontology Repository|Contact Tiffany Adrain (tiffany-adrain@uiowa.edu) at The University of Iowa Paleontology Repository http://www.uiowa.edu/~geology/paleo",1895/1910|2006-20-02,,"This digital image may be used for educational purposes, as long as it is not altered in any way. No commercial reproduction or distribution of this file is permitted without permission.","Calvin Geological Photographs|This digital collection contains the geology-related images originally digitized for the Dept. of Geosciences' Calvin web exhibit: http://www.uiowa.edu/~calvin/calvin.htm . Calvin's images of Iowa City can be viewed in the Iowa City Town and Campus Scenes Digital Collection: http://digital.lib.uiowa.edu/ictcs|View related article: http://cdm.lib.uiowa.edu/u?/digs,5565",jpeg|5|7,,"Still image|Photographs; Dry collodion negatives",0160|1565|173611416|https://digital.lib.uiowa.edu/,,,,,,,,,,,,,,,,,,,,,,,,,,,,,,,,,,,,,,,,,,,,,,,,"<a href=""https://digital.lib.uiowa.edu/"" target=""_blank"">View this item in its source respository</a>",,,,,,,,,,,,,,,,,,,,,,,,,,,,,https://www.iowaheritage.org/files/original/fa4fea5992a4d4d2c718c18396427a45.jpg,"Remote Item","Calvin Geological Photographs",1,0
13479,https://www.iowaheritage.org/items/show/13479,"Plat book of Delaware County","United States|Iowa|Delaware County|Agriculture and Rural Life","W.W. Hixson & Co.'s 1930 plat book of Delaware County, Iowa, containing a map of the county and township maps showing land ownership",,,"W.W. Hixson & Co.|University of Iowa.  Libraries.  Map Collection",1930|2007-05-16|2007-05-16,,"Educational use only, no other permissions given. U.S. and international copyright laws may protect this digital object. Commercial use or distribution of the object is not permitted without prior permission of the copyright holder.","Hixson Plat Map Atlases of Iowa","1 atlas : 18 p. ; 21 X 28 cm.",English,"Text; Still image|Atlases; Plat books|jpg","Master image scanned with Ricoh Aficio 3228C as a JPEG. Township maps and covers scanned at 600 ppi. County maps are composites of 300 ppi scans merged with Adobe Photoshop.|173845076|https://digital.lib.uiowa.edu/",,,,,,,,,,,,,,,,,,,,,,,,,,,,,,,,,,,,,,,,,,,,,,,,"<a href=""https://digital.lib.uiowa.edu/"" target=""_blank"">View this item in its source respository</a>",,,,,,,,,,,,,,,,,,,,,,,,,,,,,https://www.iowaheritage.org/files/original/1902c115fbb53de4b56808924e166b09.jpg,"Remote Item","Hixson Plat Map Atlases of Iowa",1,0
13475,https://www.iowaheritage.org/items/show/13475,"Plat book of Delaware County","United States|Iowa|Delaware County|Agriculture and Rural Life","W.W. Hixson & Co.'s 1930 plat book of Delaware County, Iowa, containing a map of the county and township maps showing land ownership",,,"W.W. Hixson & Co.|University of Iowa.  Libraries.  Map Collection",1930|2007-05-15|2007-05-15,,"Educational use only, no other permissions given. U.S. and international copyright laws may protect this digital object. Commercial use or distribution of the object is not permitted without prior permission of the copyright holder.","Hixson Plat Map Atlases of Iowa","1 atlas : 30 p. ; 21 X 28 cm.",English,"Text; Still image|Atlases; Plat books|jpg","Master image scanned with Ricoh Aficio 3228C as a JPEG. Township maps and covers scanned at 600 ppi. County maps are composites of 300 ppi scans merged with Adobe Photoshop.|173845076|https://digital.lib.uiowa.edu/",,,,,,,,,,,,,,,,,,,,,,,,,,,,,,,,,,,,,,,,,,,,,,,,"<a href=""https://digital.lib.uiowa.edu/"" target=""_blank"">View this item in its source respository</a>",,,,,,,,,,,,,,,,,,,,,,,,,,,,,https://www.iowaheritage.org/files/original/4933e9d5eaf79767a11c21dbe29d243f.jpg,"Remote Item","Hixson Plat Map Atlases of Iowa",1,0
13180,https://www.iowaheritage.org/items/show/13180,"Oneida, Iowa. CGW","Railroad stations|Chicago Great Western Railroad Company|United States -- Iowa -- Delaware County -- Oneida|Buildings|Carriages & coaches|Railroad signals","Single story wooden depot with sign for Oneida with two sets of railroad tracks. Two wooden carts and two people on platform. Railroad signal and utility lines. Buildings in  background. ""#85""--Photograph verso.",unknown,,"University of Iowa. Libraries. Special Collections Dept.",Unknown|2005-10-24,,"Educational use only, no other permissions given. U.S. and international copyright laws may protect this digital image. Commercial use or distribution of the image is not permitted without prior permission of the copyright holder. For information see:  http://www.lib.uiowa.edu/spec-coll/help/copyright.html","John P. Vander Maas Railroadiana|John P. Vander Maas Railroadiana Collection|MSC0468|http://lib.uiowa.edu/collguides/?MSC0468|Vol. 42, Depots by county",13|17,,"Still image|Photographs|jpeg",42oneida03.jpg|169946290|https://digital.lib.uiowa.edu/,,,,,,,,,,,,,,,,,,,,,,,,,,,,,,,,,,,,,,,,,,,,,,,,"<a href=""https://digital.lib.uiowa.edu/"" target=""_blank"">View this item in its source respository</a>",,,,,,,,,,,,,,,,,,,,,,,,,,,,,https://www.iowaheritage.org/files/original/69950bd22d99499c3ca3eb65b153f8c0.jpg,"Remote Item","John P. Vander Maas Railroadiana",1,0
13179,https://www.iowaheritage.org/items/show/13179,"Manchester, Iowa. CC and P","Railroad stations|Colorado Central and Pacific Railroad Company|United States -- Iowa -- Delaware County -- Manchester|1990-2000|Grain elevators|Railroad signals","Wooden post with sign for Manchester between railroad tracks. Building and railroad signals in background. Grain elevator to right of tracks. Utility lines. ""[L]ooks S. Ron Sim photo, 2717 Cornell, D.M. IA 50313""--Photograph verso.","Sims, Ronald D.",,"University of Iowa. Libraries. Special Collections Dept.",1990-08-06|2005-10-24,,"Educational use only, no other permissions given. U.S. and international copyright laws may protect this digital image. Commercial use or distribution of the image is not permitted without prior permission of the copyright holder. For information see:  http://www.lib.uiowa.edu/spec-coll/help/copyright.html","John P. Vander Maas Railroadiana|John P. Vander Maas Railroadiana Collection|MSC0468|http://lib.uiowa.edu/collguides/?MSC0468|Vol. 42, Depots by county",13|8,,"Still image|Photographs|jpeg",42manchester03.jpg|169946290|https://digital.lib.uiowa.edu/,,,,,,,,,,,,,,,,,,,,,,,,,,,,,,,,,,,,,,,,,,,,,,,,"<a href=""https://digital.lib.uiowa.edu/"" target=""_blank"">View this item in its source respository</a>",,,,,,,,,,,,,,,,,,,,,,,,,,,,,https://www.iowaheritage.org/files/original/6b55b77db23621fd8da6df14b6542a80.jpg,"Remote Item","John P. Vander Maas Railroadiana",1,0
13178,https://www.iowaheritage.org/items/show/13178,"Masonville, Iowa. CC and P","Railroad stations|Colorado Central and Pacific Railroad Company|United States -- Iowa -- Delaware County -- Masonville|1990-2000|Grain elevators|Automobiles","Wooden post with sign for Masonville next to railroad tracks. Grain elevator to right of tracks. Automobiles in background. ""Looks E. Ron Sims photo, 2717 Cornell, D.M. IA 50313""--Photograph verso.","Sims, Ronald D.",,"University of Iowa. Libraries. Special Collections Dept.",1990-08-06|2005-10-24,,"Educational use only, no other permissions given. U.S. and international copyright laws may protect this digital image. Commercial use or distribution of the image is not permitted without prior permission of the copyright holder. For information see:  http://www.lib.uiowa.edu/spec-coll/help/copyright.html","John P. Vander Maas Railroadiana|John P. Vander Maas Railroadiana Collection|MSC0468|http://lib.uiowa.edu/collguides/?MSC0468|Vol. 42, Depots by county",9|13,,"Still image|Photographs|jpeg",42masonville02.jpg|169946290|https://digital.lib.uiowa.edu/,,,,,,,,,,,,,,,,,,,,,,,,,,,,,,,,,,,,,,,,,,,,,,,,"<a href=""https://digital.lib.uiowa.edu/"" target=""_blank"">View this item in its source respository</a>",,,,,,,,,,,,,,,,,,,,,,,,,,,,,https://www.iowaheritage.org/files/original/74db732f6c34e61bab14181ec753aed3.jpg,"Remote Item","John P. Vander Maas Railroadiana",1,0
13177,https://www.iowaheritage.org/items/show/13177,"Delhi, Iowa. MILW","Railroad stations|Chicago, Rock Island & Pacific Rail Road Co.|United States -- Iowa -- Delaware County -- Delhi|Buildings|Carriages & coaches","Single story wooden depot with sign for Delhi. Three people and small wooden cart on platform. Buildings in background. ""James L. Rueber, 2509 South Shore Drive, Clear Lake, Iowa 50428""--Photograph verso.",unknown,,"University of Iowa. Libraries. Special Collections Dept.",Unknown|2005-10-24,,"Educational use only, no other permissions given. U.S. and international copyright laws may protect this digital image. Commercial use or distribution of the image is not permitted without prior permission of the copyright holder. For information see:  http://www.lib.uiowa.edu/spec-coll/help/copyright.html","John P. Vander Maas Railroadiana|John P. Vander Maas Railroadiana Collection|MSC0468|http://lib.uiowa.edu/collguides/?MSC0468|Vol. 42, Depots by county",9|14,,"Still image|Postcards|jpeg",42delhi01.jpg|169946290|https://digital.lib.uiowa.edu/,,,,,,,,,,,,,,,,,,,,,,,,,,,,,,,,,,,,,,,,,,,,,,,,"<a href=""https://digital.lib.uiowa.edu/"" target=""_blank"">View this item in its source respository</a>",,,,,,,,,,,,,,,,,,,,,,,,,,,,,https://www.iowaheritage.org/files/original/04b0c7d758c9b5c49696358862a71a28.jpg,"Remote Item","John P. Vander Maas Railroadiana",1,0
13176,https://www.iowaheritage.org/items/show/13176,"Delaware, Iowa. CC and P","Railroad stations|Colorado Central and Pacific Railroad Company|United States -- Iowa -- Delaware County -- Delaware|1990-2000|Railroad signals","Wooden post with sign for Delaware next to railroad tracks. Buildings and bridge in background. ""Looks W. Ron Sims photo, 2717 Cornell, D.M. IA 50313""--Photograph verso.","Sims, Ronald D.",,"University of Iowa. Libraries. Special Collections Dept.",1990-08-06|2005-10-24,,"Educational use only, no other permissions given. U.S. and international copyright laws may protect this digital image. Commercial use or distribution of the image is not permitted without prior permission of the copyright holder. For information see:  http://www.lib.uiowa.edu/spec-coll/help/copyright.html","John P. Vander Maas Railroadiana|John P. Vander Maas Railroadiana Collection|MSC0468|http://lib.uiowa.edu/collguides/?MSC0468|Vol. 42, Depots by county",13|9,,"Still image|Photographs|jpeg",42delaware03.jpg|169946290|https://digital.lib.uiowa.edu/,,,,,,,,,,,,,,,,,,,,,,,,,,,,,,,,,,,,,,,,,,,,,,,,"<a href=""https://digital.lib.uiowa.edu/"" target=""_blank"">View this item in its source respository</a>",,,,,,,,,,,,,,,,,,,,,,,,,,,,,https://www.iowaheritage.org/files/original/b6bc9fa0a7cb6d0dadb033e6eb9a509b.jpg,"Remote Item","John P. Vander Maas Railroadiana",1,0
