 




﻿"Item Id","Item URI","Dublin Core:Title","Dublin Core:Subject","Dublin Core:Description","Dublin Core:Creator","Dublin Core:Source","Dublin Core:Publisher","Dublin Core:Date","Dublin Core:Contributor","Dublin Core:Rights","Dublin Core:Relation","Dublin Core:Format","Dublin Core:Language","Dublin Core:Type","Dublin Core:Identifier","Dublin Core:Coverage","Item Type Metadata:Text","Item Type Metadata:Interviewer","Item Type Metadata:Interviewee","Item Type Metadata:Location","Item Type Metadata:Transcription","Item Type Metadata:Local URL","Item Type Metadata:Original Format","Item Type Metadata:Physical Dimensions","Item Type Metadata:Duration","Item Type Metadata:Compression","Item Type Metadata:Producer","Item Type Metadata:Director","Item Type Metadata:Bit Rate/Frequency","Item Type Metadata:Time Summary","Item Type Metadata:Email Body","Item Type Metadata:Subject Line","Item Type Metadata:From","Item Type Metadata:To","Item Type Metadata:CC","Item Type Metadata:BCC","Item Type Metadata:Number of Attachments","Item Type Metadata:Standards","Item Type Metadata:Objectives","Item Type Metadata:Materials","Item Type Metadata:Lesson Plan Text","Item Type Metadata:URL","Item Type Metadata:Event Type","Item Type Metadata:Participants","Item Type Metadata:Birth Date","Item Type Metadata:Birthplace","Item Type Metadata:Death Date","Item Type Metadata:Occupation","Item Type Metadata:Biographical Text","Item Type Metadata:Bibliography","Item Type Metadata:Digital Reproduction Information","Item Type Metadata:Repository","Item Type Metadata:Repository Collection","Item Type Metadata:Contact information.","Item Type Metadata:File Name","Item Type Metadata:Notes","Item Type Metadata:Digital item created","Item Type Metadata:Digital item modified","Item Type Metadata:Executive Orders","Item Type Metadata:Record Created","Item Type Metadata:Record Modified","Item Type Metadata:Transcription2","Item Type Metadata:Source URL","Omeka Legacy File:Additional Creator","Omeka Legacy File:Transcriber","Omeka Legacy File:Producer","Omeka Legacy File:Render Device","Omeka Legacy File:Render Details","Omeka Legacy File:Capture Date","Omeka Legacy File:Capture Device","Omeka Legacy File:Capture Details","Omeka Legacy File:Change History","Omeka Legacy File:Watermark","Omeka Legacy File:Encryption","Omeka Legacy File:Compression","Omeka Legacy File:Post Processing","Omeka Image File:Width","Omeka Image File:Height","Omeka Image File:Bit Depth","Omeka Image File:Channels","Omeka Image File:Exif String","Omeka Image File:Exif Array","Omeka Image File:IPTC String","Omeka Image File:IPTC Array","Omeka Video File:Bitrate","Omeka Video File:Duration","Omeka Video File:Sample Rate","Omeka Video File:Codec","Omeka Video File:Width","Omeka Video File:Height",tags,file,itemType,collection,public,featured
31074,https://www.iowaheritage.org/items/show/31074,"Junior primary students examining birds, The University of Iowa, March 31, 1930","Universities & colleges|University of Iowa|United States -- Iowa -- Iowa City|1930-1940|Schools|School children|Birds|Birdcages|Classrooms|University of Iowa. College of Education","The University Elementary School,established in 1915, was a laboratory or experimental school directed through the College of Education for the training of principals, superintendents and teachers. Along with the University High School, it was closed in 1972 due to lack of funding.","Kent, Frederick W. (Frederick Wallace), 1894-1984",,"University of Iowa. Libraries. University Archives",1930-03-31|2010-09-12,,"Educational use only, no other permissions given. U.S. and international copyright laws may protect this digital object. Commercial use or distribution of the object is not permitted without prior permission of the copyright holder.","Iowa City Town and Campus Scenes|Frederick W. Kent Collection of Photographs, 1866-2000|http://www.lib.uiowa.edu/collguides/?RG30.0001.01|Prints|Organizations|University Elementary School|University Elementary School|Scanned with Ricoh Aficio 3228C @ 600 ppi. Master image saved in TIFF format",5|7,,"Still image|Photographs|jpeg",RG30.0001.01|index.cpd|https://digital.lib.uiowa.edu/,,,,,,,,,,,,,,,,,,,,,,,,,,,,,,,,,,,,,,,,,,,,,,,,"<a href=""https://digital.lib.uiowa.edu/"" target=""_blank"">View this item in its source respository</a>",,,,,,,,,,,,,,,,,,,,,,,,,,,,,https://www.iowaheritage.org/files/original/ab20aac43adcac0efeaa1bea2df6738d.jpg,"Remote Item","Iowa City Town and Campus Scenes",1,0
31564,https://www.iowaheritage.org/items/show/31564,"Junior primary student building bookshelf, The University of Iowa, April 10, 1941","Universities & colleges|Elementary schools|University of Iowa|United States -- Iowa -- Iowa City|1940-1950|Schools|School children|Shelving|Furniture|University of Iowa. College of Education|North Hall (Iowa City, Iowa)","The University Elementary School,established in 1915, was a laboratory or experimental school directed through the College of Education for the training of principals, superintendents and teachers. Along with the University High School, it was closed in 1972 due to lack of funding. It was located in what is now North Hall.","Kent, Frederick W. (Frederick Wallace), 1894-1984",,"University of Iowa. Libraries. University Archives",1941-04-10|2010-09-12,,"Educational use only, no other permissions given. U.S. and international copyright laws may protect this digital object. Commercial use or distribution of the object is not permitted without prior permission of the copyright holder.","Iowa City Town and Campus Scenes|Frederick W. Kent Collection of Photographs, 1866-2000|http://www.lib.uiowa.edu/collguides/?RG30.0001.01|Prints|Organizations|University Elementary School|University Elementary School|Scanned with Ricoh Aficio 3228C @ 600 ppi. Master image saved in TIFF format",,,"Still image|Photographs|jpeg",RG30.0001.01|org22-0058.jpg|https://digital.lib.uiowa.edu/,,,,,,,,,,,,,,,,,,,,,,,,,,,,,,,,,,,,,,,,,,,,,,,,"<a href=""https://digital.lib.uiowa.edu/"" target=""_blank"">View this item in its source respository</a>",,,,,,,,,,,,,,,,,,,,,,,,,,,,,https://www.iowaheritage.org/files/original/6af9838e2fc7e99bd5bf3971caf09f1b.jpg,"Remote Item","Iowa City Town and Campus Scenes",1,0
31077,https://www.iowaheritage.org/items/show/31077,"Junior primary reading class, The University of Iowa, March 31, 1930","Universities & colleges|University of Iowa|United States -- Iowa -- Iowa City|1930-1940|Classrooms|Reading|Tables|School children|University of Iowa. College of Education","The University Elementary School,established in 1915, was a laboratory or experimental school directed through the College of Education for the training of principals, superintendents and teachers. Along with the University High School, it was closed in 1972 due to lack of funding.","Kent, Frederick W. (Frederick Wallace), 1894-1984",,"University of Iowa. Libraries. University Archives",1930-03-31|2010-09-12,,"Educational use only, no other permissions given. U.S. and international copyright laws may protect this digital object. Commercial use or distribution of the object is not permitted without prior permission of the copyright holder.","Iowa City Town and Campus Scenes|Frederick W. Kent Collection of Photographs, 1866-2000|http://www.lib.uiowa.edu/collguides/?RG30.0001.01|Prints|Organizations|University Elementary School|University Elementary School|Scanned with Ricoh Aficio 3228C @ 600 ppi. Master image saved in TIFF format",5|7,,"Still image|Photographs|jpeg",RG30.0001.01|index.cpd|https://digital.lib.uiowa.edu/,,,,,,,,,,,,,,,,,,,,,,,,,,,,,,,,,,,,,,,,,,,,,,,,"<a href=""https://digital.lib.uiowa.edu/"" target=""_blank"">View this item in its source respository</a>",,,,,,,,,,,,,,,,,,,,,,,,,,,,,https://www.iowaheritage.org/files/original/7cc7f251c4743d69e0af58474aef1a67.jpg,"Remote Item","Iowa City Town and Campus Scenes",1,0
31535,https://www.iowaheritage.org/items/show/31535,"Junior primary playhouse, The University of Iowa, July 11, 1938","Universities & colleges|Elementary schools|University of Iowa|United States -- Iowa -- Iowa City|1930-1940|Schools|School children|Playhouses|Play (Recreation)|Toys|University of Iowa. College of Education","The University Elementary School,established in 1915, was a laboratory or experimental school directed through the College of Education for the training of principals, superintendents and teachers. Along with the University High School, it was closed in 1972 due to lack of funding.","Kent, Frederick W. (Frederick Wallace), 1894-1984",,"University of Iowa. Libraries. University Archives",1938-07-11|2010-09-12,,"Educational use only, no other permissions given. U.S. and international copyright laws may protect this digital object. Commercial use or distribution of the object is not permitted without prior permission of the copyright holder.","Iowa City Town and Campus Scenes|Frederick W. Kent Collection of Photographs, 1866-2000|http://www.lib.uiowa.edu/collguides/?RG30.0001.01|Prints|Organizations|University Elementary School|University Elementary School|Scanned with Ricoh Aficio 3228C @ 600 ppi. Master image saved in TIFF format",,,"Still image|Photographs; Photocollages (Photographic compositions)|jpeg",RG30.0001.01|org22-0035.jpg|https://digital.lib.uiowa.edu/,,,,,,,,,,,,,,,,,,,,,,,,,,,,,,,,,,,,,,,,,,,,,,,,"<a href=""https://digital.lib.uiowa.edu/"" target=""_blank"">View this item in its source respository</a>",,,,,,,,,,,,,,,,,,,,,,,,,,,,,https://www.iowaheritage.org/files/original/f8c618668853c13f9518acb007a61ec1.jpg,"Remote Item","Iowa City Town and Campus Scenes",1,0
31536,https://www.iowaheritage.org/items/show/31536,"Junior primary playhouse and puppet show, The University of Iowa, July 1938","Universities & colleges|Elementary schools|University of Iowa|United States -- Iowa -- Iowa City|1930-1940|Schools|School children|Playhouses|Toys|Puppet shows|Puppets|University of Iowa. College of Education","The University Elementary School,established in 1915, was a laboratory or experimental school directed through the College of Education for the training of principals, superintendents and teachers. Along with the University High School, it was closed in 1972 due to lack of funding.","Kent, Frederick W. (Frederick Wallace), 1894-1984",,"University of Iowa. Libraries. University Archives",1938-07|2010-09-12,,"Educational use only, no other permissions given. U.S. and international copyright laws may protect this digital object. Commercial use or distribution of the object is not permitted without prior permission of the copyright holder.","Iowa City Town and Campus Scenes|Frederick W. Kent Collection of Photographs, 1866-2000|http://www.lib.uiowa.edu/collguides/?RG30.0001.01|Prints|Organizations|University Elementary School|University Elementary School|Scanned with Ricoh Aficio 3228C @ 600 ppi. Master image saved in TIFF format",,,"Still image|Photographs; Photocollages (Photographic compositions)|jpeg",RG30.0001.01|org22-0036.jpg|https://digital.lib.uiowa.edu/,,,,,,,,,,,,,,,,,,,,,,,,,,,,,,,,,,,,,,,,,,,,,,,,"<a href=""https://digital.lib.uiowa.edu/"" target=""_blank"">View this item in its source respository</a>",,,,,,,,,,,,,,,,,,,,,,,,,,,,,https://www.iowaheritage.org/files/original/778186fbe5dc28758490c9bf2068be10.jpg,"Remote Item","Iowa City Town and Campus Scenes",1,0
31537,https://www.iowaheritage.org/items/show/31537,"Junior primary nature study and puppet show, The University of Iowa, July 1938","Universities & colleges|Elementary schools|University of Iowa|United States -- Iowa -- Iowa City|1930-1940|Schools|School children|Walls|Puppet shows|Puppets|Nature|Science|University of Iowa. College of Education|North Hall (Iowa City, Iowa)","The University Elementary School,established in 1915, was a laboratory or experimental school directed through the College of Education for the training of principals, superintendents and teachers. Along with the University High School, it was closed in 1972 due to lack of funding. It was located in what is now North Hall.","Kent, Frederick W. (Frederick Wallace), 1894-1984",,"University of Iowa. Libraries. University Archives",1938-07|2010-09-12,,"Educational use only, no other permissions given. U.S. and international copyright laws may protect this digital object. Commercial use or distribution of the object is not permitted without prior permission of the copyright holder.","Iowa City Town and Campus Scenes|Frederick W. Kent Collection of Photographs, 1866-2000|http://www.lib.uiowa.edu/collguides/?RG30.0001.01|Prints|Organizations|University Elementary School|University Elementary School|Scanned with Ricoh Aficio 3228C @ 600 ppi. Master image saved in TIFF format",,,"Still image|Photographs; Photocollages (Photographic compositions); Contact sheets|jpeg",RG30.0001.01|org22-0037.jpg|https://digital.lib.uiowa.edu/,,,,,,,,,,,,,,,,,,,,,,,,,,,,,,,,,,,,,,,,,,,,,,,,"<a href=""https://digital.lib.uiowa.edu/"" target=""_blank"">View this item in its source respository</a>",,,,,,,,,,,,,,,,,,,,,,,,,,,,,https://www.iowaheritage.org/files/original/d020eeacbc93b47a1df43b90d1ed48d0.jpg,"Remote Item","Iowa City Town and Campus Scenes",1,0
31075,https://www.iowaheritage.org/items/show/31075,"Junior primary drawing class, The University of Iowa, March 31, 1930","Universities & colleges|University of Iowa|United States -- Iowa -- Iowa City|1930-1940|Drawing|Classrooms|School children|Schools|University of Iowa. College of Education","The University Elementary School,established in 1915, was a laboratory or experimental school directed through the College of Education for the training of principals, superintendents and teachers. Along with the University High School, it was closed in 1972 due to lack of funding.","Kent, Frederick W. (Frederick Wallace), 1894-1984",,"University of Iowa. Libraries. University Archives",1930-03-31|2010-09-12,,"Educational use only, no other permissions given. U.S. and international copyright laws may protect this digital object. Commercial use or distribution of the object is not permitted without prior permission of the copyright holder.","Iowa City Town and Campus Scenes|Frederick W. Kent Collection of Photographs, 1866-2000|http://www.lib.uiowa.edu/collguides/?RG30.0001.01|Prints|Organizations|University Elementary School|University Elementary School|Scanned with Ricoh Aficio 3228C @ 600 ppi. Master image saved in TIFF format",5|7,,"Still image|Photographs|jpeg",RG30.0001.01|index.cpd|https://digital.lib.uiowa.edu/,,,,,,,,,,,,,,,,,,,,,,,,,,,,,,,,,,,,,,,,,,,,,,,,"<a href=""https://digital.lib.uiowa.edu/"" target=""_blank"">View this item in its source respository</a>",,,,,,,,,,,,,,,,,,,,,,,,,,,,,https://www.iowaheritage.org/files/original/e5c3d45d892386bbfd6bdd71b0151be3.jpg,"Remote Item","Iowa City Town and Campus Scenes",1,0
31229,https://www.iowaheritage.org/items/show/31229,"Junior primary classroom, The University of Iowa elementary school, February 1929","Universities & colleges|Elementary schools|University of Iowa|United States -- Iowa -- Iowa City|1920-1930|Laboratory schools|Classrooms|Students|School children|Wood blocks|Flags|University of Iowa. College of Education","The University Elementary School,established in 1915, was a laboratory or experimental school directed through the College of Education for the training of principals, superintendents and teachers. Along with the University High School, it was closed in 1972 due to lack of funding.","Kent, Frederick W. (Frederick Wallace), 1894-1984",,"University of Iowa. Libraries. University Archives",1929-02|2010-09-12,,"Educational use only, no other permissions given. U.S. and international copyright laws may protect this digital object. Commercial use or distribution of the object is not permitted without prior permission of the copyright holder.","Iowa City Town and Campus Scenes|Frederick W. Kent Collection of Photographs, 1866-2000|http://www.lib.uiowa.edu/collguides/?RG30.0001.01|Prints|Organizations|University Elementary School|University Elementary School|Scanned with Ricoh Aficio 3228C @ 600 ppi. Master image saved in TIFF format",,,"Still image|Photographs|jpeg",RG30.0001.01|index.cpd|https://digital.lib.uiowa.edu/,,,,,,,,,,,,,,,,,,,,,,,,,,,,,,,,,,,,,,,,,,,,,,,,"<a href=""https://digital.lib.uiowa.edu/"" target=""_blank"">View this item in its source respository</a>",,,,,,,,,,,,,,,,,,,,,,,,,,,,,https://www.iowaheritage.org/files/original/2e7e6f11f7db2ecd7ff45c236b9919e5.jpg,"Remote Item","Iowa City Town and Campus Scenes",1,0
31201,https://www.iowaheritage.org/items/show/31201,"Junior primary class, The University of Iowa, January 14, 1926","Universities & colleges|Elementary schools|University of Iowa|United States -- Iowa -- Iowa City|1920-1930|Schools|School children|Classrooms|Tables|University of Iowa. College of Education","The University Elementary School,established in 1915, was a laboratory or experimental school directed through the College of Education for the training of principals, superintendents and teachers. Along with the University High School, it was closed in 1972 due to lack of funding. It was originally housed in the Old Dental Building, known at the time as the Observational Schools Building.","Kent, Frederick W. (Frederick Wallace), 1894-1984",,"University of Iowa. Libraries. University Archives",1926-01-14|2010-09-12,,"Educational use only, no other permissions given. U.S. and international copyright laws may protect this digital object. Commercial use or distribution of the object is not permitted without prior permission of the copyright holder.","Iowa City Town and Campus Scenes|Frederick W. Kent Collection of Photographs, 1866-2000|http://www.lib.uiowa.edu/collguides/?RG30.0001.01|Prints|Organizations|University Elementary School|University Elementary School|Scanned with Ricoh Aficio 3228C @ 600 ppi. Master image saved in TIFF format",,,"Still image|Photographs|jpeg",RG30.0001.01|index.cpd|https://digital.lib.uiowa.edu/,,,,,,,,,,,,,,,,,,,,,,,,,,,,,,,,,,,,,,,,,,,,,,,,"<a href=""https://digital.lib.uiowa.edu/"" target=""_blank"">View this item in its source respository</a>",,,,,,,,,,,,,,,,,,,,,,,,,,,,,https://www.iowaheritage.org/files/original/94703d718a628c38958494476400f809.jpg,"Remote Item","Iowa City Town and Campus Scenes",1,0
31200,https://www.iowaheritage.org/items/show/31200,"Junior primary class, The University of Iowa, January 14, 1926","Universities & colleges|Elementary schools|University of Iowa|United States -- Iowa -- Iowa City|1920-1930|Schools|School children|Classrooms|Tables|University of Iowa. College of Education","The University Elementary School,established in 1915, was a laboratory or experimental school directed through the College of Education for the training of principals, superintendents and teachers. Along with the University High School, it was closed in 1972 due to lack of funding. It was originally housed in the Old Dental Building, known at the time as the Observational Schools Building.","Kent, Frederick W. (Frederick Wallace), 1894-1984",,"University of Iowa. Libraries. University Archives",1926-01-14|2010-09-12,,"Educational use only, no other permissions given. U.S. and international copyright laws may protect this digital object. Commercial use or distribution of the object is not permitted without prior permission of the copyright holder.","Iowa City Town and Campus Scenes|Frederick W. Kent Collection of Photographs, 1866-2000|http://www.lib.uiowa.edu/collguides/?RG30.0001.01|Prints|Organizations|University Elementary School|University Elementary School|Scanned with Ricoh Aficio 3228C @ 600 ppi. Master image saved in TIFF format",,,"Still image|Photographs|jpeg",RG30.0001.01|index.cpd|https://digital.lib.uiowa.edu/,,,,,,,,,,,,,,,,,,,,,,,,,,,,,,,,,,,,,,,,,,,,,,,,"<a href=""https://digital.lib.uiowa.edu/"" target=""_blank"">View this item in its source respository</a>",,,,,,,,,,,,,,,,,,,,,,,,,,,,,https://www.iowaheritage.org/files/original/fd5b885ccc874faf20693347c86643d5.jpg,"Remote Item","Iowa City Town and Campus Scenes",1,0
