 




﻿"Item Id","Item URI","Dublin Core:Title","Dublin Core:Subject","Dublin Core:Description","Dublin Core:Creator","Dublin Core:Source","Dublin Core:Publisher","Dublin Core:Date","Dublin Core:Contributor","Dublin Core:Rights","Dublin Core:Relation","Dublin Core:Format","Dublin Core:Language","Dublin Core:Type","Dublin Core:Identifier","Dublin Core:Coverage","Item Type Metadata:Text","Item Type Metadata:Interviewer","Item Type Metadata:Interviewee","Item Type Metadata:Location","Item Type Metadata:Transcription","Item Type Metadata:Local URL","Item Type Metadata:Original Format","Item Type Metadata:Physical Dimensions","Item Type Metadata:Duration","Item Type Metadata:Compression","Item Type Metadata:Producer","Item Type Metadata:Director","Item Type Metadata:Bit Rate/Frequency","Item Type Metadata:Time Summary","Item Type Metadata:Email Body","Item Type Metadata:Subject Line","Item Type Metadata:From","Item Type Metadata:To","Item Type Metadata:CC","Item Type Metadata:BCC","Item Type Metadata:Number of Attachments","Item Type Metadata:Standards","Item Type Metadata:Objectives","Item Type Metadata:Materials","Item Type Metadata:Lesson Plan Text","Item Type Metadata:URL","Item Type Metadata:Event Type","Item Type Metadata:Participants","Item Type Metadata:Birth Date","Item Type Metadata:Birthplace","Item Type Metadata:Death Date","Item Type Metadata:Occupation","Item Type Metadata:Biographical Text","Item Type Metadata:Bibliography","Item Type Metadata:Digital Reproduction Information","Item Type Metadata:Repository","Item Type Metadata:Repository Collection","Item Type Metadata:Contact information.","Item Type Metadata:File Name","Item Type Metadata:Notes","Item Type Metadata:Digital item created","Item Type Metadata:Digital item modified","Item Type Metadata:Executive Orders","Item Type Metadata:Record Created","Item Type Metadata:Record Modified","Item Type Metadata:Transcription2","Item Type Metadata:Source URL","Omeka Legacy File:Additional Creator","Omeka Legacy File:Transcriber","Omeka Legacy File:Producer","Omeka Legacy File:Render Device","Omeka Legacy File:Render Details","Omeka Legacy File:Capture Date","Omeka Legacy File:Capture Device","Omeka Legacy File:Capture Details","Omeka Legacy File:Change History","Omeka Legacy File:Watermark","Omeka Legacy File:Encryption","Omeka Legacy File:Compression","Omeka Legacy File:Post Processing","Omeka Image File:Width","Omeka Image File:Height","Omeka Image File:Bit Depth","Omeka Image File:Channels","Omeka Image File:Exif String","Omeka Image File:Exif Array","Omeka Image File:IPTC String","Omeka Image File:IPTC Array","Omeka Video File:Bitrate","Omeka Video File:Duration","Omeka Video File:Sample Rate","Omeka Video File:Codec","Omeka Video File:Width","Omeka Video File:Height",tags,file,itemType,collection,public,featured
78995,https://www.iowaheritage.org/items/show/78995,"Benny Roop Residence, Oskaloosa, Iowa, (1856-1866)","Benny Roop|Distillery|Residence|Mid 19th Century|Oskaloosa|Iowa|Mahaska County","The Roop, Harbour, and Co. Steam Flour Mill and Distillery, more commonly known as the Benny Roop Distillery, opened officially in 1852 for business and is the oldest known distillery in all of Mahaska County, Iowa.  This is a picture of the home of Benjamin Roop, one of the owners of the distillery.  Roop lived in this home between its erection in 1856 until 1866, when his business ventures took a turn for the worse in 1871 when another one of his business establishments in Beacon, Iowa, failed, costing him his fortune amassed from the Roop, Harbour, and Co.'s earnings.  Roop died from apoplexy on January 25, 1872 in Springfield, Missouri at the age of 72.","Chuck Russell","Chuck Russell","Chuck Russell","""2009-06-22""",,www.wmpenn.edu/library/about.html,,"still image/jpeg 2000",,image,"www.wmpenn.edu/library/about.html|http://cdm16125.contentdm.oclc.org/u?/p270701coll6,243",,,,,,,,,,,,,,,,,,,,,,,,,,,,,,,,,,,,,,,,,,,,,,,,"<a href=""http://cdm16125.contentdm.oclc.org/u?/p270701coll6,243"" target=""_blank"">View this item in its source respository</a>",,,,,,,,,,,,,,,,,,,,,,,,,,,,,https://www.iowaheritage.org/files/original/570db5edf3f0e9fa34b4b14eb4eb1b01.jpg,"Remote Item","Mahaska History",1,0
78535,https://www.iowaheritage.org/items/show/78535,"Bernice Lacey on the tennis court outside of her home in Oskaloosa; Mahaska County; Iowa","Congressman|John F. Lacey|Bernice Lacey|Tennis Court|301 North Market Street|6th Iowa District|Oskaloosa|Mahaska County|Iowa","This is an image of Congressman John F. Lacey's daughter, Bernice, goofing around on the family tennis court circa 1900.  Women's apparel around 1900 was not the most comfortable, especially if playing a sport like tennis, as seen here.  Congressman Lacey's family lived on North Market Street in Oskaloosa, Iowa.","Mahaska County Historical Society","Historical Archives","Mahaska County Historical Society",1900?|2008-08-13,"John F. Lacey",www.nelsonpioneer.org,,"still image/jpeg",,image,"Mahaska County Historical Society|http://cdm16125.contentdm.oclc.org/u?/p270701coll7,197",,,,,,,,,,,,,,,,,,,,,,,,,,,,,,,,,,,,,,,,,,,,,,,,"<a href=""http://cdm16125.contentdm.oclc.org/u?/p270701coll7,197"" target=""_blank"">View this item in its source respository</a>",,,,,,,,,,,,,,,,,,,,,,,,,,,,,https://www.iowaheritage.org/files/original/17d4322918f3d730b999dd9c671490fe.jpg,"Remote Item","Mahaska County Historical Society",1,0
78528,https://www.iowaheritage.org/items/show/78528,"Bernice Lacey, daughter of Congressman John F. Lacey of Iowa, with friends, circa 1900; Oskaloosa; Mahaska County; Iowa","Congressman|John F. Lacey|Washington, D.C.|Bernice|6th Iowa District|Oskaloosa|Mahaska County|Iowa","This is a photograph of Bernice Lacey, daughter of Congressman John F. Lacey from the 6th Iowa District, whose home residence was Oskaloosa, Iowa.  This picture was during a parade in Oskaloosa and depicts the clothing and accessories worn by young women during the time.","Mahaska County Historical Society","Historical Archives","Mahaska County Historical Society",1900?|2008-08-12,"John F. Lacey",www.nelsonpioneer.org,,"still image/jpeg",,image,"Mahaska County Historical Society|http://cdm16125.contentdm.oclc.org/u?/p270701coll7,190",,,,,,,,,,,,,,,,,,,,,,,,,,,,,,,,,,,,,,,,,,,,,,,,"<a href=""http://cdm16125.contentdm.oclc.org/u?/p270701coll7,190"" target=""_blank"">View this item in its source respository</a>",,,,,,,,,,,,,,,,,,,,,,,,,,,,,https://www.iowaheritage.org/files/original/d09d6bf99a54375a256e0cd70917432b.jpg,"Remote Item","Mahaska County Historical Society",1,0
64272,https://www.iowaheritage.org/items/show/64272,"Bike registration legislation","State governments|Iowa|Automobiles|2000-2010|State politics|States|Legislation|Legislators|Legislature|Bicycles|Cyclists|Law|Laws|Automobile drivers|Automobile accidents|Bottles|Bicycles|Cyclists|Bananas|Stars|Fences|Roads|Signs","ST8HWS; Share the road","Duffy, Brian, 1955-",,"University of Iowa. Libraries. Special Collections Dept.",2004-01-25|2011-04,,"Educational use only, no other permissions given. Copyright to this digital object is owned by The Des Moines Register; it may not be downloaded, reproduced, or distributed without written permission. For more information, contact the Special Collections Department.","Editorial Cartoons of Brian Duffy; Des Moines Register Cartoonists|Papers of Brian Duffy|Des Moines Register",,English,"Still image|Editorial cartoons",MSC916|duffy-040125|http://digital.lib.uiowa.edu/cdm/ref/collection/duffy/id/110,,,,,,,,,,,,,,,,,,,,,,,,,,,,,,,,,,,,,,,,,,,,,,,,"<a href=""http://digital.lib.uiowa.edu/cdm/ref/collection/duffy/id/110"" target=""_blank"">View this item in its source respository</a>",,,,,,,,,,,,,,,,,,,,,,,,,,,,,https://www.iowaheritage.org/files/original/500c9a307167a163b38c2f194e29945d.jpg,"Remote Item","Editorial Cartoons of Brian Duffy",1,0
78921,https://www.iowaheritage.org/items/show/78921,"Bike Stroll in Downtown Oskaloosa, Iowa, Circa 1915","Bike|Stroll|Oskaloosa|Iowa|Mahaska County|Early 20th Century|Town Square","This image captures children riding their bikes through the downtown square in Oskaloosa, Iowa, around 1915.  The streets have brick pavement in this photograph, but there are no automobiles present, illustrating the fact that few residents in Oskaloosa, Iowa owned automobiles yet.  In all truth, the bicycle was still an object of awe at this point, which is why many of the people in the photo look captivated by all the bicyclists.","Chuck Russell","Chuck Russell","Chuck Russell","""2009-06-05""",,www.wmpenn.edu/library/about.html,,"still image/jpeg 2000",,image,"www.wmpenn.edu/library/about.html|http://cdm16125.contentdm.oclc.org/u?/p270701coll6,206",,,,,,,,,,,,,,,,,,,,,,,,,,,,,,,,,,,,,,,,,,,,,,,,"<a href=""http://cdm16125.contentdm.oclc.org/u?/p270701coll6,206"" target=""_blank"">View this item in its source respository</a>",,,,,,,,,,,,,,,,,,,,,,,,,,,,,https://www.iowaheritage.org/files/original/4d3217a637ab5bb93cee6c64f34129b7.jpg,"Remote Item","Mahaska History",1,0
78936,https://www.iowaheritage.org/items/show/78936,"Billiards Hall, Oskaloosa, Iowa, Circa 1900","Billiards Hall|Oskaloosa|Iowa|Mahaska County|Early 20th Century","Billiards was known as a gentleman's game throughout American and European society in the 19th Century, although the game became popular in Great Britain around 1770, eventually making its way to America predominantly in the early 19th Century.  As the game became more popular in America in the late 19th Century into the early 20th Century, the game's audience appealed to more social groups, thus attracting crowds that did not necessarily fit the bill of a gentleman.  In this photograph stands a man outside a billiards hall in downtown Oskaloosa, Iowa around 1900.  To the left and right of the billiards hall sign are goods that would have been available to purchase while a billiards game would be in progress.  Instead of focusing on the store, the patrons focused more on the game and products from the store were purchased without much thought as a result of the centerpiece, that which being the billiards table.","Chuck Russell","Chuck Russell","Chuck Russell","""2009-06-05""",,www.wmpenn.edu/library/about.html,,"still image/jpeg 2000",,image,"www.wmpenn.edu/library/about.html|http://cdm16125.contentdm.oclc.org/u?/p270701coll6,213",,,,,,,,,,,,,,,,,,,,,,,,,,,,,,,,,,,,,,,,,,,,,,,,"<a href=""http://cdm16125.contentdm.oclc.org/u?/p270701coll6,213"" target=""_blank"">View this item in its source respository</a>",,,,,,,,,,,,,,,,,,,,,,,,,,,,,https://www.iowaheritage.org/files/original/6363872eb6d686accdb7cd1ed458f4bb.jpg,"Remote Item","Mahaska History",1,0
78447,https://www.iowaheritage.org/items/show/78447,"Birds Eye View of the Oskaloosa Business District, 1903-1907; Mahaska County, Iowa","Street Scene|Community|Business|District|Stores|Early 20th Century|Oskaloosa|Mahaska County|Iowa","This is a photograph of the downtown business district of Oskaloosa as it appeared between the years 1903-07.  The main focus of the picture is on North and South Market Street, where the vast majority of business were located in Oskaloosa during the time.  However, businesses were also thriving on High Avenue, A Avenue, and North A Street.  The trees and grassy areas of the picture are part of the Oskaloosa town square, a popular gathering place for citizens of Oskaloosa.","Mahaska County Historical Society","Historical Archives","Mahaska County Historical Society",1903-07|2008-08-07,,www.nelsonpioneer.org,,"still image/jpeg",,image,"Mahaska County Historical Society|http://cdm16125.contentdm.oclc.org/u?/p270701coll7,107",,,,,,,,,,,,,,,,,,,,,,,,,,,,,,,,,,,,,,,,,,,,,,,,"<a href=""http://cdm16125.contentdm.oclc.org/u?/p270701coll7,107"" target=""_blank"">View this item in its source respository</a>",,,,,,,,,,,,,,,,,,,,,,,,,,,,,https://www.iowaheritage.org/files/original/2bcc2ca4130ea855e6ad7f9a43720327.jpg,"Remote Item","Mahaska County Historical Society",1,0
78606,https://www.iowaheritage.org/items/show/78606,"Black Oak Township; Mahaska County; Iowa","Map|Townships|Mahaska County|Iowa","Black Oak Township sits on the western edge of Mahaska County.  Two communities have summed up the township in its history; Lardeo and Leighton.  Leighton is the only community that still exists today in the township.","Mahaska County Historical Society","Mahaska County Collection","Curtis Media Corporation: Dallas, Texas",2008-07-14,,www.wmpenn.edu/library/library/about.html,,"still image/jpeg",,image,"Wilcox Library|http://cdm16125.contentdm.oclc.org/u?/p270701coll6,40",,,,,,,,,,,,,,,,,,,,,,,,,,,,,,,,,,,,,,,,,,,,,,,,"<a href=""http://cdm16125.contentdm.oclc.org/u?/p270701coll6,40"" target=""_blank"">View this item in its source respository</a>",,,,,,,,,,,,,,,,,,,,,,,,,,,,,https://www.iowaheritage.org/files/original/28894600bb5bb1ee16c4d674659258e4.jpg,"Remote Item","Mahaska History",1,0
79023,https://www.iowaheritage.org/items/show/79023,"Blackford Feed Company, Oskaloosa, Iowa, Circa 1890","Farming|Blackford Feed Company|Oskaloosa|Iowa|Mahaska County|Late 19th Century","This image portrays the Blackford Feed Company situated in Oskaloosa, Iowa around 1890.  Feed was an essential element to cattle farms, as they still are much today.  The farmer would take his horse and wagon into the feed store and pick up several sacks worth of feed in order to raise their cattle properly, so that they may turn around and sell their cattle for a good price when the time came.","Chuck Russell","Chuck Russell","Chuck Russell","""2009-06-24""",,www.wmpenn.edu/library/about.html,,"still image/jpeg 2000",,image,"www.wmpenn.edu/library/about.html|http://cdm16125.contentdm.oclc.org/u?/p270701coll6,257",,,,,,,,,,,,,,,,,,,,,,,,,,,,,,,,,,,,,,,,,,,,,,,,"<a href=""http://cdm16125.contentdm.oclc.org/u?/p270701coll6,257"" target=""_blank"">View this item in its source respository</a>",,,,,,,,,,,,,,,,,,,,,,,,,,,,,https://www.iowaheritage.org/files/original/49a0494ffe7643ece7b9e51b56a08aa4.jpg,"Remote Item","Mahaska History",1,0
64586,https://www.iowaheritage.org/items/show/64586,"Board of Regents duplication study","Education|Iowa|Blackboards|1980-1990|Education and state|Universities & colleges|States|Boys|Painting|Painters|Paintbrushes|Paints & varnishes|Whitewashing|Hats",,"Duffy, Brian, 1955-",,"University of Iowa. Libraries. Special Collections Dept.",1989-05|2011-04,,"Educational use only, no other permissions given. Copyright to this digital object is owned by The Des Moines Register; it may not be downloaded, reproduced, or distributed without written permission. For more information, contact the Special Collections Department.","Editorial Cartoons of Brian Duffy; Des Moines Register Cartoonists|Papers of Brian Duffy|Des Moines Register",,English,"Still image|Editorial cartoons","MSC916|duffy-8905xx 2|http://digital.lib.uiowa.edu/cdm/ref/collection/duffy/id/424",,,,,,,,,,,,,,,,,,,,,,,,,,,,,,,,,,,,,,,,,,,,,,,,"<a href=""http://digital.lib.uiowa.edu/cdm/ref/collection/duffy/id/424"" target=""_blank"">View this item in its source respository</a>",,,,,,,,,,,,,,,,,,,,,,,,,,,,,https://www.iowaheritage.org/files/original/5069accdd1285dc238e47008fe342d58.jpg,"Remote Item","Editorial Cartoons of Brian Duffy",1,0
