 




﻿"Item Id","Item URI","Dublin Core:Title","Dublin Core:Subject","Dublin Core:Description","Dublin Core:Creator","Dublin Core:Source","Dublin Core:Publisher","Dublin Core:Date","Dublin Core:Contributor","Dublin Core:Rights","Dublin Core:Relation","Dublin Core:Format","Dublin Core:Language","Dublin Core:Type","Dublin Core:Identifier","Dublin Core:Coverage","Item Type Metadata:Text","Item Type Metadata:Interviewer","Item Type Metadata:Interviewee","Item Type Metadata:Location","Item Type Metadata:Transcription","Item Type Metadata:Local URL","Item Type Metadata:Original Format","Item Type Metadata:Physical Dimensions","Item Type Metadata:Duration","Item Type Metadata:Compression","Item Type Metadata:Producer","Item Type Metadata:Director","Item Type Metadata:Bit Rate/Frequency","Item Type Metadata:Time Summary","Item Type Metadata:Email Body","Item Type Metadata:Subject Line","Item Type Metadata:From","Item Type Metadata:To","Item Type Metadata:CC","Item Type Metadata:BCC","Item Type Metadata:Number of Attachments","Item Type Metadata:Standards","Item Type Metadata:Objectives","Item Type Metadata:Materials","Item Type Metadata:Lesson Plan Text","Item Type Metadata:URL","Item Type Metadata:Event Type","Item Type Metadata:Participants","Item Type Metadata:Birth Date","Item Type Metadata:Birthplace","Item Type Metadata:Death Date","Item Type Metadata:Occupation","Item Type Metadata:Biographical Text","Item Type Metadata:Bibliography","Item Type Metadata:Digital Reproduction Information","Item Type Metadata:Repository","Item Type Metadata:Repository Collection","Item Type Metadata:Contact information.","Item Type Metadata:File Name","Item Type Metadata:Notes","Item Type Metadata:Digital item created","Item Type Metadata:Digital item modified","Item Type Metadata:Executive Orders","Item Type Metadata:Record Created","Item Type Metadata:Record Modified","Item Type Metadata:Transcription2","Item Type Metadata:Source URL","Omeka Legacy File:Additional Creator","Omeka Legacy File:Transcriber","Omeka Legacy File:Producer","Omeka Legacy File:Render Device","Omeka Legacy File:Render Details","Omeka Legacy File:Capture Date","Omeka Legacy File:Capture Device","Omeka Legacy File:Capture Details","Omeka Legacy File:Change History","Omeka Legacy File:Watermark","Omeka Legacy File:Encryption","Omeka Legacy File:Compression","Omeka Legacy File:Post Processing","Omeka Image File:Width","Omeka Image File:Height","Omeka Image File:Bit Depth","Omeka Image File:Channels","Omeka Image File:Exif String","Omeka Image File:Exif Array","Omeka Image File:IPTC String","Omeka Image File:IPTC Array","Omeka Video File:Bitrate","Omeka Video File:Duration","Omeka Video File:Sample Rate","Omeka Video File:Codec","Omeka Video File:Width","Omeka Video File:Height",tags,file,itemType,collection,public,featured
15780,https://www.iowaheritage.org/items/show/15780,"SUI College of Dentistry, class of 1910","Dental education|University of Iowa. College of Dentistry|United States -- Iowa -- Iowa City|1910-1920|Students","Composite class photo board including faculty and students. Photos missing from composite: Harold Charles Byers (1909?), Ernest Thomas Lake, Harold J. Nichols (1909), George Laurence Rice (1909)",,,"University of Iowa. College of Dentistry; University of Iowa Libraries",1910,,"Educational use only, no other permissions given. Copyright to this resource is held by the University of Iowa College of Dentistry, and is provided here for educational purposes only. It may not be reproduced or distributed in any format without written permission of the University of Iowa College of Dentistry.","Dentistry College Class Photographs",jpeg|50|40,,"Still image|Photographs",173691318|https://digital.lib.uiowa.edu/,,,,,,,,,,,,,,,,,,,,,,,,,,,,,,,,,,,,,,,,,,,,,,,,"<a href=""https://digital.lib.uiowa.edu/"" target=""_blank"">View this item in its source respository</a>",,,,,,,,,,,,,,,,,,,,,,,,,,,,,https://www.iowaheritage.org/files/original/691c3ed31157b951a76ba1a48b82f948.jpg,"Remote Item","Dentistry College Class Photographs",1,0
15563,https://www.iowaheritage.org/items/show/15563,"Bean family letters and papers, 1912-1962","Families|Bean family|Sons of the American Revolution. Iowa Society|United States -- Iowa -- Fairfield|1910-1920|Death|Births|Bean, John Victor, 1843-1919|Bean, Elizabeth Wilson, 1851-1933|Greenleaf, Mary Bean, b. 1886|Bean, John, 1751-1814|Byerly, Helen Bean|United States -- Iowa -- Iowa City|1950-1960|1960-1970",,"Bean, John Victor, 1843-1919; Rice, Elvira Fifield; Bush, Stephen; Tanner, John W.",,"University of Iowa. Libraries. Special Collections Dept.",1912/1962|2009-04,,"Educational use only, no other permissions given. U.S. and international copyright laws may protect this digital image. Commercial use or distribution of the image is not permitted without prior permission of the copyright holder.","Civil War Diaries and Letters; Abraham Lincoln Collection|Bean Family papers|http://lib.uiowa.edu/collguides/?MSC0452",,,"Text; Still image|Photocopies; Portraits; Obituaries; Application forms; Genealogies; Notebooks; Correspondence|jpeg",MSC0452|31858055128387|https://digital.lib.uiowa.edu/,,,,,,,,,,,,,,,,,,,,,,,,,,,,,,,,,,,,,,,,,,,,,,,,"<a href=""https://digital.lib.uiowa.edu/"" target=""_blank"">View this item in its source respository</a>",,,,,,,,,,,,,,,,,,,,,,,,,,,,,https://www.iowaheritage.org/files/original/ab15710b6011cf5bfa194c3cb2d06a59.jpg,"Remote Item","Civil War Diaries and Letters",1,0
15496,https://www.iowaheritage.org/items/show/15496,"Steep headwater slopes of the tributaries of Buck Creek, Washington, Iowa, October 21, 1918","Geology|United States -- Iowa -- Crawford County -- Washington Township|1910-1920|Cenozoic -- Pleistocene|Croplands","Located in  Washington Twp. sections 9 and 10.","Lees, James H.","Photographs scanned using Epson Expression 1680 scanner at 300 ppi, 8-bit greyscale.","University of Iowa. Dept. of Geoscience. Paleontology Repository|Contact Tiffany Adrain (tiffany-adrain@uiowa.edu) at The University of Iowa Paleontology Repository http://www.uiowa.edu/~geology/paleo",1918-10-21|2006-03-27,,"This digital image may be used for educational purposes, as long as it is not altered in any way. No commercial reproduction or distribution of this file is permitted without permission.","Calvin Geological Photographs|This digital collection contains the geology-related images originally digitized for the Dept. of Geosciences' Calvin web exhibit: http://www.uiowa.edu/~calvin/calvin.htm . Calvin's images of Iowa City can be viewed in the Iowa City Town and Campus Scenes Digital Collection: http://digital.lib.uiowa.edu/ictcs",jpeg|5|7,,"Still image|Photographs",7286|173611416|https://digital.lib.uiowa.edu/,,,,,,,,,,,,,,,,,,,,,,,,,,,,,,,,,,,,,,,,,,,,,,,,"<a href=""https://digital.lib.uiowa.edu/"" target=""_blank"">View this item in its source respository</a>",,,,,,,,,,,,,,,,,,,,,,,,,,,,,https://www.iowaheritage.org/files/original/9fdfd28767bcef1790a15ba80c973dff.jpg,"Remote Item","Calvin Geological Photographs",1,0
15494,https://www.iowaheritage.org/items/show/15494,"Geology Club on the steps of Old Science Hall, The University of Iowa, May 24, 1916","Geology|University of Iowa|United States -- Iowa -- Johnson County -- Iowa City|1910-1920|People|Clubs|Universities & colleges",,unknown,"Photographs scanned using Epson Expression 1680 scanner at 300 ppi, 8-bit greyscale.","University of Iowa. Dept. of Geoscience. Paleontology Repository|Contact Tiffany Adrain (tiffany-adrain@uiowa.edu) at The University of Iowa Paleontology Repository http://www.uiowa.edu/~geology/paleo",1916-05-24|2006-03-27,,"This digital image may be used for educational purposes, as long as it is not altered in any way. No commercial reproduction or distribution of this file is permitted without permission.","Calvin Geological Photographs|This digital collection contains the geology-related images originally digitized for the Dept. of Geosciences' Calvin web exhibit: http://www.uiowa.edu/~calvin/calvin.htm . Calvin's images of Iowa City can be viewed in the Iowa City Town and Campus Scenes Digital Collection: http://digital.lib.uiowa.edu/ictcs",jpeg|5|7,,"Still image|Photographs; Dry collodion negatives",4577|8364|173611416|https://digital.lib.uiowa.edu/,,,,,,,,,,,,,,,,,,,,,,,,,,,,,,,,,,,,,,,,,,,,,,,,"<a href=""https://digital.lib.uiowa.edu/"" target=""_blank"">View this item in its source respository</a>",,,,,,,,,,,,,,,,,,,,,,,,,,,,,https://www.iowaheritage.org/files/original/8594e7149bc0abccc9e2dc34c75fa2f4.jpg,"Remote Item","Calvin Geological Photographs",1,0
15456,https://www.iowaheritage.org/items/show/15456,"Chicago, Milwaukee and St. Paul Railroad cut, Manning, Iowa, June 10, 1915","Geology|Chicago, Milwaukee, and St. Paul Railway Company|United States -- Iowa -- Carroll County -- Manning|1910-1920|Cenozoic -- Pleistocene|Railroad cuts","Located 3.5 miles East of Manning, Warren Twp., section 13, N.W. 1/4.",unknown,"Photographs scanned using Epson Expression 1680 scanner at 300 ppi, 8-bit greyscale.","University of Iowa. Dept. of Geoscience. Paleontology Repository|Contact Tiffany Adrain (tiffany-adrain@uiowa.edu) at The University of Iowa Paleontology Repository http://www.uiowa.edu/~geology/paleo",1915-06-10|2006-03-23,,"This digital image may be used for educational purposes, as long as it is not altered in any way. No commercial reproduction or distribution of this file is permitted without permission.","Calvin Geological Photographs|This digital collection contains the geology-related images originally digitized for the Dept. of Geosciences' Calvin web exhibit: http://www.uiowa.edu/~calvin/calvin.htm . Calvin's images of Iowa City can be viewed in the Iowa City Town and Campus Scenes Digital Collection: http://digital.lib.uiowa.edu/ictcs",jpeg|5|7,,"Still image|Photographs; Dry collodion negatives",4494|5046|173611416|https://digital.lib.uiowa.edu/,,,,,,,,,,,,,,,,,,,,,,,,,,,,,,,,,,,,,,,,,,,,,,,,"<a href=""https://digital.lib.uiowa.edu/"" target=""_blank"">View this item in its source respository</a>",,,,,,,,,,,,,,,,,,,,,,,,,,,,,https://www.iowaheritage.org/files/original/15a8d2372afd0041c1d197fd1e006a21.jpg,"Remote Item","Calvin Geological Photographs",1,0
15408,https://www.iowaheritage.org/items/show/15408,"American Association of Geographers Davis Excursion, St. Paul, Minn., 1912","Geology|American Association of Geographers|United States -- Minnesota -- Ramsey County -- St. Paul|1910-1920|People",,unknown,"Photographs scanned using Epson Expression 1680 scanner at 300 ppi, 8-bit greyscale.","University of Iowa. Dept. of Geoscience. Paleontology Repository|Contact Tiffany Adrain (tiffany-adrain@uiowa.edu) at The University of Iowa Paleontology Repository http://www.uiowa.edu/~geology/paleo",1912|2006-03-02,,"This digital image may be used for educational purposes, as long as it is not altered in any way. No commercial reproduction or distribution of this file is permitted without permission.","Calvin Geological Photographs|This digital collection contains the geology-related images originally digitized for the Dept. of Geosciences' Calvin web exhibit: http://www.uiowa.edu/~calvin/calvin.htm . Calvin's images of Iowa City can be viewed in the Iowa City Town and Campus Scenes Digital Collection: http://digital.lib.uiowa.edu/ictcs",jpeg|5|7,,"Still image|Photographs; Dry collodion negatives",0746|4290|173611416|https://digital.lib.uiowa.edu/,,,,,,,,,,,,,,,,,,,,,,,,,,,,,,,,,,,,,,,,,,,,,,,,"<a href=""https://digital.lib.uiowa.edu/"" target=""_blank"">View this item in its source respository</a>",,,,,,,,,,,,,,,,,,,,,,,,,,,,,https://www.iowaheritage.org/files/original/8e4cf375d79093b78008aadc170fc114.jpg,"Remote Item","Calvin Geological Photographs",1,0
15406,https://www.iowaheritage.org/items/show/15406,"Group photo from the International Geological Conference, Canada, 1913",Geology|Canada|1910-1920|People,,unknown,"Photographs scanned using Epson Expression 1680 scanner at 300 ppi, 8-bit greyscale.","University of Iowa. Dept. of Geoscience. Paleontology Repository|Contact Tiffany Adrain (tiffany-adrain@uiowa.edu) at The University of Iowa Paleontology Repository http://www.uiowa.edu/~geology/paleo",1913|2006-03-02,,"This digital image may be used for educational purposes, as long as it is not altered in any way. No commercial reproduction or distribution of this file is permitted without permission.","Calvin Geological Photographs|This digital collection contains the geology-related images originally digitized for the Dept. of Geosciences' Calvin web exhibit: http://www.uiowa.edu/~calvin/calvin.htm . Calvin's images of Iowa City can be viewed in the Iowa City Town and Campus Scenes Digital Collection: http://digital.lib.uiowa.edu/ictcs",jpeg|5|7,,"Still image|Photographs; Dry collodion negatives",0747|4289|173611416|https://digital.lib.uiowa.edu/,,,,,,,,,,,,,,,,,,,,,,,,,,,,,,,,,,,,,,,,,,,,,,,,"<a href=""https://digital.lib.uiowa.edu/"" target=""_blank"">View this item in its source respository</a>",,,,,,,,,,,,,,,,,,,,,,,,,,,,,https://www.iowaheritage.org/files/original/f30cbcc3e950914ecd83a49a5724a105.jpg,"Remote Item","Calvin Geological Photographs",1,0
14728,https://www.iowaheritage.org/items/show/14728,"Melvin, Iowa. CRIP","Railroad stations|Chicago, Rock Island & Pacific Rail Road Co.|United States -- Iowa -- Osceola County -- Melvin|1910-1920|Buildings|Carriages & coaches|Railroad cars|Horses","Single story depot with sign for Melvin. Train on tracks next to depot. People standing on platform. Horses and wagon backed up to platform. ""CRI&P Depot Melvin, Iowa""--Caption on postcard.",unknown,,"University of Iowa. Libraries. Special Collections Dept.",1910|2006-05-04,,"Educational use only, no other permissions given. U.S. and international copyright laws may protect this digital image. Commercial use or distribution of the image is not permitted without prior permission of the copyright holder. For information see:  http://www.lib.uiowa.edu/spec-coll/help/copyright.html","John P. Vander Maas Railroadiana|John P. Vander Maas Railroadiana Collection|MSC0468|http://lib.uiowa.edu/collguides/?MSC0468|Vol. 45, Depots by county",9|14,,"Still image|Postcards|jpeg",45melvin02.jpg|169946290|https://digital.lib.uiowa.edu/,,,,,,,,,,,,,,,,,,,,,,,,,,,,,,,,,,,,,,,,,,,,,,,,"<a href=""https://digital.lib.uiowa.edu/"" target=""_blank"">View this item in its source respository</a>",,,,,,,,,,,,,,,,,,,,,,,,,,,,,https://www.iowaheritage.org/files/original/30a9d12afc8169b81d4e96192bd93271.jpg,"Remote Item","John P. Vander Maas Railroadiana",1,0
14705,https://www.iowaheritage.org/items/show/14705,"Highland Center, IA. MILW","Railroad stations|Chicago, Rock Island & Pacific Rail Road Co.|United States -- Iowa -- Wapello County -- Highland Center|1910-1920|Buildings|Railroad signals","Single story wooden depot with platform and signal on pole.",unknown,,"University of Iowa. Libraries. Special Collections Dept.",1911|2006-04-25,,"Educational use only, no other permissions given. U.S. and international copyright laws may protect this digital image. Commercial use or distribution of the image is not permitted without prior permission of the copyright holder. For information see:  http://www.lib.uiowa.edu/spec-coll/help/copyright.html","John P. Vander Maas Railroadiana|John P. Vander Maas Railroadiana Collection|MSC0468|http://lib.uiowa.edu/collguides/?MSC0468|Vol. 47, Depots by county",8|12,,"Still image|Photographs|jpeg",47highlandcenter01.jpg|169946290|https://digital.lib.uiowa.edu/,,,,,,,,,,,,,,,,,,,,,,,,,,,,,,,,,,,,,,,,,,,,,,,,"<a href=""https://digital.lib.uiowa.edu/"" target=""_blank"">View this item in its source respository</a>",,,,,,,,,,,,,,,,,,,,,,,,,,,,,https://www.iowaheritage.org/files/original/4acc3c03bd8f1d416f240af36db2c3f9.jpg,"Remote Item","John P. Vander Maas Railroadiana",1,0
14615,https://www.iowaheritage.org/items/show/14615,"Gravity, Iowa. CBQ","Railroad stations|Chicago, Burlington & Quincy Railroad Company|United States -- Iowa -- Taylor County -- Gravity|1910-1920|Buildings|Carriages & coaches|Railroad signals","Single story wooden depot with cart and signal on pole.",unknown,,"University of Iowa. Libraries. Special Collections Dept.",1914|2006-04-20,,"Educational use only, no other permissions given. U.S. and international copyright laws may protect this digital image. Commercial use or distribution of the image is not permitted without prior permission of the copyright holder. For information see:  http://www.lib.uiowa.edu/spec-coll/help/copyright.html","John P. Vander Maas Railroadiana|John P. Vander Maas Railroadiana Collection|MSC0468|http://lib.uiowa.edu/collguides/?MSC0468|Vol. 47, Depots by county",8|14,,"Still image|Photographs|jpeg",47gravity01.jpg|169946290|https://digital.lib.uiowa.edu/,,,,,,,,,,,,,,,,,,,,,,,,,,,,,,,,,,,,,,,,,,,,,,,,"<a href=""https://digital.lib.uiowa.edu/"" target=""_blank"">View this item in its source respository</a>",,,,,,,,,,,,,,,,,,,,,,,,,,,,,https://www.iowaheritage.org/files/original/f3d05c7531d8177203956f67517d1688.jpg,"Remote Item","John P. Vander Maas Railroadiana",1,0
