 




﻿"Item Id","Item URI","Dublin Core:Title","Dublin Core:Subject","Dublin Core:Description","Dublin Core:Creator","Dublin Core:Source","Dublin Core:Publisher","Dublin Core:Date","Dublin Core:Contributor","Dublin Core:Rights","Dublin Core:Relation","Dublin Core:Format","Dublin Core:Language","Dublin Core:Type","Dublin Core:Identifier","Dublin Core:Coverage","Item Type Metadata:Text","Item Type Metadata:Interviewer","Item Type Metadata:Interviewee","Item Type Metadata:Location","Item Type Metadata:Transcription","Item Type Metadata:Local URL","Item Type Metadata:Original Format","Item Type Metadata:Physical Dimensions","Item Type Metadata:Duration","Item Type Metadata:Compression","Item Type Metadata:Producer","Item Type Metadata:Director","Item Type Metadata:Bit Rate/Frequency","Item Type Metadata:Time Summary","Item Type Metadata:Email Body","Item Type Metadata:Subject Line","Item Type Metadata:From","Item Type Metadata:To","Item Type Metadata:CC","Item Type Metadata:BCC","Item Type Metadata:Number of Attachments","Item Type Metadata:Standards","Item Type Metadata:Objectives","Item Type Metadata:Materials","Item Type Metadata:Lesson Plan Text","Item Type Metadata:URL","Item Type Metadata:Event Type","Item Type Metadata:Participants","Item Type Metadata:Birth Date","Item Type Metadata:Birthplace","Item Type Metadata:Death Date","Item Type Metadata:Occupation","Item Type Metadata:Biographical Text","Item Type Metadata:Bibliography","Item Type Metadata:Digital Reproduction Information","Item Type Metadata:Repository","Item Type Metadata:Repository Collection","Item Type Metadata:Contact information.","Item Type Metadata:File Name","Item Type Metadata:Notes","Item Type Metadata:Digital item created","Item Type Metadata:Digital item modified","Item Type Metadata:Executive Orders","Item Type Metadata:Record Created","Item Type Metadata:Record Modified","Item Type Metadata:Transcription2","Item Type Metadata:Source URL","Omeka Legacy File:Additional Creator","Omeka Legacy File:Transcriber","Omeka Legacy File:Producer","Omeka Legacy File:Render Device","Omeka Legacy File:Render Details","Omeka Legacy File:Capture Date","Omeka Legacy File:Capture Device","Omeka Legacy File:Capture Details","Omeka Legacy File:Change History","Omeka Legacy File:Watermark","Omeka Legacy File:Encryption","Omeka Legacy File:Compression","Omeka Legacy File:Post Processing","Omeka Image File:Width","Omeka Image File:Height","Omeka Image File:Bit Depth","Omeka Image File:Channels","Omeka Image File:Exif String","Omeka Image File:Exif Array","Omeka Image File:IPTC String","Omeka Image File:IPTC Array","Omeka Video File:Bitrate","Omeka Video File:Duration","Omeka Video File:Sample Rate","Omeka Video File:Codec","Omeka Video File:Width","Omeka Video File:Height",tags,file,itemType,collection,public,featured
98618,https://www.iowaheritage.org/items/show/98618,"Annual report, 1953.","Appanoose County Soil and Water Conservation District Annual Report","Annual report highlights district accomplishment, financial information, and personnel information. ","Appanoose County Soil and Water Conservation District",,"State Library of Iowa|Appanoose County Soil and Water Conservation District",1953,"Appanoose County Soil and Water Conservation District. For questions about copyright, contact the State Library of Iowa at  <a href=""http://www.statelibraryofiowa.org"">http://www.statelibraryofiowa.org</a>.","This item is protected by copyright and/or related rights. Your are free to use this Item in any way that is permitted by the copyright and related rights legislation that applies to your use. For other uses you need to obtain permission from the rights-holder(s). <a href=""http://rightsstatements.org/"">http://rightsstatements.org</a>",,pdf,eng,"Text; Document ",,,,,,,,,,,,,,,,,,,,,,,,,,,,,,,,,,,,,,,,,OCR_AR_1953_001.pdf,,,,,,,,,,,,,,,,,,,,,,,,,,,,,,,,,,,,"Arthur Streepy,Bill Stark,Bob Dean,Centerville Airport,Centerville High School,Centerville Iowa,Forest Main,George Scott,Grover Kaster,Howell-Lindley Farm,Italian Trefoil,Jack Miller,Moravia Iowa,Professor Hughes - Iowa State University,R.C. Wilson,Rex Wells,Trefoil,Vocational Ag Class,Wayne Dietz",https://www.iowaheritage.org/files/original/197d628273fca647af19e1ad0be6bec1.pdf,Document,"Appanoose County Soil and Water Conservation District Historic Collection",1,0
98617,https://www.iowaheritage.org/items/show/98617,"Annual report, 1952.","Appanoose County Soil and Water Conservation District Annual Report","Annual report highlights district accomplishment, financial information, and personnel information. ","Appanoose County Soil and Water Conservation District",,"State Library of Iowa|Appanoose County Soil and Water Conservation District",1952,"Appanoose County Soil and Water Conservation District. For questions about copyright, contact the State Library of Iowa at  <a href=""http://www.statelibraryofiowa.org"">http://www.statelibraryofiowa.org</a>.","This item is protected by copyright and/or related rights. Your are free to use this Item in any way that is permitted by the copyright and related rights legislation that applies to your use. For other uses you need to obtain permission from the rights-holder(s). <a href=""http://rightsstatements.org/"">http://rightsstatements.org</a>",,pdf,eng,"Text; Document ",,,,,,,,,,,,,,,,,,,,,,,,,,,,,,,,,,,,,,,,,OCR_AR_1952_001.pdf,,,,,,,,,,,,,,,,,,,,,,,,,,,,,,,,,,,,"Amos Siglin,Appanoose County,Arthur Streepy,Bill Stark,Birdsfoot Trefoil,Bob Bear,Carl Murrell,Centerville Airport,Centerville Iowa,Charley Wright,Don Carr,George Davis,George Scott,Glenn McNair,Grass Silage,Harold Bauman,Jack Howell,John McCaughey,Kids Fish Derby,LaVern Whitacker,Lee Benz,Lee Neal,Legume Silage,Marvelle McElvain,Moravia Iowa,R.C. Wilson,Randell Wakefield,Ray Phillips,Shorty Harper,Spoilage,Sportsmen's Club",https://www.iowaheritage.org/files/original/e9caab19d3f98bcc123ccaa0d7669c5f.pdf,"Still Image","Appanoose County Soil and Water Conservation District Historic Collection",1,0
98616,https://www.iowaheritage.org/items/show/98616,"Annual report, 1951.","Appanoose County Soil and Water Conservation District Annual Report","Annual report highlights district accomplishment, financial information, and personnel information. ","Appanoose County Soil and Water Conservation District",,"State Library of Iowa|Appanoose County Soil and Water Conservation District",1951,"Appanoose County Soil and Water Conservation District. For questions about copyright, contact the State Library of Iowa at  <a href=""http://www.statelibraryofiowa.org"">http://www.statelibraryofiowa.org</a>.","This item is protected by copyright and/or related rights. Your are free to use this Item in any way that is permitted by the copyright and related rights legislation that applies to your use. For other uses you need to obtain permission from the rights-holder(s). <a href=""http://rightsstatements.org/"">http://rightsstatements.org</a>",,pdf,eng,"Text; Document ",,,,,,,,,,,,,,,,,,,,,,,,,,,,,,,,,,,,,,,,,OCR_AR_1951_001.pdf,,,,,,,,,,,,,,,,,,,,,,,,,,,,,,,,,,,,"Annual Report,Appanoose County",https://www.iowaheritage.org/files/original/d18783540bf029b0b2378a53ed3046da.pdf,"Still Image","Appanoose County Soil and Water Conservation District Historic Collection",1,0
98610,https://www.iowaheritage.org/items/show/98610,"Annual report, 1950.","Appanoose County Soil and Water Conservation District Annual Report","Annual report highlights district accomplishment, financial information, and personnel information. ","Appanoose County Soil and Water Conservation District",,"State Library of Iowa|Appanoose County Soil and Water Conservation District",1950,"Appanoose County Soil and Water Conservation District. For questions about copyright, contact the State Library of Iowa at  <a href=""http://www.statelibraryofiowa.org"">http://www.statelibraryofiowa.org</a>.","This item is protected by copyright and/or related rights. Your are free to use this Item in any way that is permitted by the copyright and related rights legislation that applies to your use. For other uses you need to obtain permission from the rights-holder(s). <a href=""http://rightsstatements.org/"">http://rightsstatements.org</a>",,pdf,eng,"Text; Document ",,,,,,,,,,,,,,,,,,,,,,,,,,,,,,,,,,,,,,,,,OCR_AR_1950_001.pdf,,,,,,,,,,,,,,,,,,,,,,,,,,,,,,,,,,,,"Annual Report,Appanoose County",https://www.iowaheritage.org/files/original/44fcfa3998de94b47d86ae080fc3d7c3.pdf,Document,"Appanoose County Soil and Water Conservation District Historic Collection",1,0
98609,https://www.iowaheritage.org/items/show/98609,"Annual report, 1949.","Appanoose County Soil and Water Conservation District Annual Report","Annual report highlights district accomplishment, financial information, and personnel information. ","Appanoose County Soil and Water Conservation District",,"State Library of Iowa|Appanoose County Soil and Water Conservation District",1949,"Appanoose County Soil and Water Conservation District. For questions about copyright, contact the State Library of Iowa at  <a href=""http://www.statelibraryofiowa.org"">http://www.statelibraryofiowa.org</a>.","This item is protected by copyright and/or related rights. Your are free to use this Item in any way that is permitted by the copyright and related rights legislation that applies to your use. For other uses you need to obtain permission from the rights-holder(s). <a href=""http://rightsstatements.org/"">http://rightsstatements.org</a>",,pdf,eng,"Text; Document ",,,,,,,,,,,,,,,,,,,,,,,,,,,,,,,,,,,,,,,,,OCR_AR_1949_001.pdf,,,,,,,,,,,,,,,,,,,,,,,,,,,,,,,,,,,,"Annual Report,Appanoose County",https://www.iowaheritage.org/files/original/9a695112fe93bf1336076ac9ae94a21a.pdf,Document,"Appanoose County Soil and Water Conservation District Historic Collection",1,0
98608,https://www.iowaheritage.org/items/show/98608,"Annual report, 1948.","Appanoose County Soil and Water Conservation District Annual Report","Annual report highlights district accomplishment, financial information, and personnel information. ","Appanoose County Soil and Water Conservation District",,"State Library of Iowa|Appanoose County Soil and Water Conservation District",1948,"Appanoose County Soil and Water Conservation District. For questions about copyright, contact the State Library of Iowa at  <a href=""http://www.statelibraryofiowa.org"">http://www.statelibraryofiowa.org</a>.","This item is protected by copyright and/or related rights. Your are free to use this Item in any way that is permitted by the copyright and related rights legislation that applies to your use. For other uses you need to obtain permission from the rights-holder(s). <a href=""http://rightsstatements.org/"">http://rightsstatements.org</a>",,pdf,eng,"Text; Document ",,,,,,,,,,,,,,,,,,,,,,,,,,,,,,,,,,,,,,,,,OCR_AR_1948_001.pdf,,,,,,,,,,,,,,,,,,,,,,,,,,,,,,,,,,,,"Annual Report,Appanoose County",https://www.iowaheritage.org/files/original/ef10c3a4c8483b6610b6afbdf4d6997c.pdf,Document,"Appanoose County Soil and Water Conservation District Historic Collection",1,0
98607,https://www.iowaheritage.org/items/show/98607,"Annual report, 1947.","Appanoose County Soil and Water Conservation District Annual Report","Annual report highlights district accomplishment, financial information, and personnel information. ","Appanoose County Soil and Water Conservation District",,"State Library of Iowa|Appanoose County Soil and Water Conservation District",1947,"Appanoose County Soil and Water Conservation District. For questions about copyright, contact the State Library of Iowa at  <a href=""http://www.statelibraryofiowa.org"">http://www.statelibraryofiowa.org</a>.","This item is protected by copyright and/or related rights. Your are free to use this Item in any way that is permitted by the copyright and related rights legislation that applies to your use. For other uses you need to obtain permission from the rights-holder(s). <a href=""http://rightsstatements.org/"">http://rightsstatements.org</a>",,pdf,eng,"Text; Document ",,,,,,,,,,,,,,,,,,,,,,,,,,,,,,,,,,,,,,,,,OCR_AR_1947_001.pdf,,,,,,,,,,,,,,,,,,,,,,,,,,,,,,,,,,,,"Annual Report,Appanoose County",https://www.iowaheritage.org/files/original/4092e0d6902e379f61f5831595e734a0.pdf,Document,"Appanoose County Soil and Water Conservation District Historic Collection",1,0
98606,https://www.iowaheritage.org/items/show/98606,"Annual report, 1945.","Appanoose County Soil and Water Conservation District ; Annual Report","Annual report highlights district accomplishment, financial information, and personnel information. ","Appanoose County Soil and Water Conservation District",,"State Library of Iowa|Appanoose County Soil and Water Conservation District",1945,"Appanoose County Soil and Water Conservation District. For questions about copyright, contact the State Library of Iowa at  <a href=""http://www.statelibraryofiowa.org"">http://www.statelibraryofiowa.org</a>.","This item is protected by copyright and/or related rights. Your are free to use this Item in any way that is permitted by the copyright and related rights legislation that applies to your use. For other uses you need to obtain permission from the rights-holder(s). <a href=""http://rightsstatements.org/"">http://rightsstatements.org</a>",,pdf,eng,"Text; Document ",,,,,,,,,,,,,,,,,,,,,,,,,,,,,,,,,,,,,,,,,OCR_AR_1945_001.pdf,,,,,,,,,,,,,,,,,,,,,,,,,,,,,,,,,,,,"Annual Report,Appanoose County",https://www.iowaheritage.org/files/original/d829c59cdbebd9a068652721504740bf.pdf,"Still Image","Appanoose County Soil and Water Conservation District Historic Collection",1,0
98592,https://www.iowaheritage.org/items/show/98592,"Annual report, 1944.","Appanoose County Soil and Water Conservation District Annual Report","Annual report highlights district accomplishment, financial information, and personnel information. ","Appanoose County Soil and Water Conservation District",,"State Library of Iowa|Appanoose County Soil and Water Conservation District",1944,"Appanoose County Soil and Water Conservation District. For questions about copyright, contact the State Library of Iowa at  <a href=""http://www.statelibraryofiowa.org"">http://www.statelibraryofiowa.org</a>.","This item is protected by copyright and/or related rights. Your are free to use this Item in any way that is permitted by the copyright and related rights legislation that applies to your use. For other uses you need to obtain permission from the rights-holder(s). <a href=""http://rightsstatements.org/"">http://rightsstatements.org</a>",,pdf,eng,"Text; Document ",,,,,,,,,,,,,,,,,,,,,,,,,,,,,,,,,,,,,,,,,OCR_AR_1944_001.pdf,,,,,,,,,,,,,,,,,,,,,,,,,,,,,,,,,,,,,https://www.iowaheritage.org/files/original/8e7aac58b7c66990fd6d2d351b327912.pdf,Document,"Appanoose County Soil and Water Conservation District Historic Collection",1,0
98539,https://www.iowaheritage.org/items/show/98539,"Aerial photos of Appanoose County farmland.","Appanoose County Soil and Water Conservation District","Aerial photos of Appanoose County farmland.","Appanoose County Soil and Water Conservation District",,"State Library of Iowa|Appanoose Soil and Water Conservation District","Unknown ","Appanoose County Soil and Water Conservation District. For questions about copyright, contact the State Library of Iowa at  <a href=""http://www.statelibraryofiowa.org"">http://www.statelibraryofiowa.org</a>.","This item is protected by copyright and/or related rights. Your are free to use this Item in any way that is permitted by the copyright and related rights legislation that applies to your use. For other uses you need to obtain permission from the rights-holder(s). <a href=""http://rightsstatements.org/"">http://rightsstatements.org</a>",,pdf,eng,"Still Image; Photograph ",,,,,,,,,,,,,,,,,,,,,,,,,,,,,,,,,,,,,,,,,AppanooseSWCD_AerialImages.pdf,,,,,,,,,,,,,,,,,,,,,,,,,,,,,,,,,,,,"Appanoose County,Farmland",https://www.iowaheritage.org/files/original/4c207dcc9fb8ba93a9810a3411fa0a2b.pdf,"Still Image","Appanoose County Soil and Water Conservation District Historic Collection",1,0
