 




﻿"Item Id","Item URI","Dublin Core:Title","Dublin Core:Subject","Dublin Core:Description","Dublin Core:Creator","Dublin Core:Source","Dublin Core:Publisher","Dublin Core:Date","Dublin Core:Contributor","Dublin Core:Rights","Dublin Core:Relation","Dublin Core:Format","Dublin Core:Language","Dublin Core:Type","Dublin Core:Identifier","Dublin Core:Coverage","Item Type Metadata:Text","Item Type Metadata:Interviewer","Item Type Metadata:Interviewee","Item Type Metadata:Location","Item Type Metadata:Transcription","Item Type Metadata:Local URL","Item Type Metadata:Original Format","Item Type Metadata:Physical Dimensions","Item Type Metadata:Duration","Item Type Metadata:Compression","Item Type Metadata:Producer","Item Type Metadata:Director","Item Type Metadata:Bit Rate/Frequency","Item Type Metadata:Time Summary","Item Type Metadata:Email Body","Item Type Metadata:Subject Line","Item Type Metadata:From","Item Type Metadata:To","Item Type Metadata:CC","Item Type Metadata:BCC","Item Type Metadata:Number of Attachments","Item Type Metadata:Standards","Item Type Metadata:Objectives","Item Type Metadata:Materials","Item Type Metadata:Lesson Plan Text","Item Type Metadata:URL","Item Type Metadata:Event Type","Item Type Metadata:Participants","Item Type Metadata:Birth Date","Item Type Metadata:Birthplace","Item Type Metadata:Death Date","Item Type Metadata:Occupation","Item Type Metadata:Biographical Text","Item Type Metadata:Bibliography","Item Type Metadata:Digital Reproduction Information","Item Type Metadata:Repository","Item Type Metadata:Repository Collection","Item Type Metadata:Contact information.","Item Type Metadata:File Name","Item Type Metadata:Notes","Item Type Metadata:Digital item created","Item Type Metadata:Digital item modified","Item Type Metadata:Executive Orders","Item Type Metadata:Record Created","Item Type Metadata:Record Modified","Item Type Metadata:Transcription2","Item Type Metadata:Source URL","Omeka Legacy File:Additional Creator","Omeka Legacy File:Transcriber","Omeka Legacy File:Producer","Omeka Legacy File:Render Device","Omeka Legacy File:Render Details","Omeka Legacy File:Capture Date","Omeka Legacy File:Capture Device","Omeka Legacy File:Capture Details","Omeka Legacy File:Change History","Omeka Legacy File:Watermark","Omeka Legacy File:Encryption","Omeka Legacy File:Compression","Omeka Legacy File:Post Processing","Omeka Image File:Width","Omeka Image File:Height","Omeka Image File:Bit Depth","Omeka Image File:Channels","Omeka Image File:Exif String","Omeka Image File:Exif Array","Omeka Image File:IPTC String","Omeka Image File:IPTC Array","Omeka Video File:Bitrate","Omeka Video File:Duration","Omeka Video File:Sample Rate","Omeka Video File:Codec","Omeka Video File:Width","Omeka Video File:Height",tags,file,itemType,collection,public,featured
7616,https://www.iowaheritage.org/items/show/7616,"Letting the genie loose upon the world again.","International relations|Sino-Japanese Conflict|Japan|Soldier|war|peace|aggression|treaties|China|Asia|gladiator|sword.",,"Darling, Jay N. (Jay Norwood), 1876-1962","The Editorial cartoons of J.N. ""Ding"" Darling [electronic resource] : The Cowles Collection, Drake University, 1912-1962",,1933/01/12|1933,,"Copyright is owned by the ""Ding"" Darling Wildlife Society; it is administered on behalf of the Society by The University of Iowa. While use within the classroom is encouraged without specific authorization, publishing this cartoon in any format requires written permission. See policy and permissions procedure at: http://www.lib.uiowa.edu/spec-coll/services/dingdarling_fees.html","Cowles Library, Drake University, 2507 University Ave., Des Moines, IA 50311-4505.",,,,"330112.jpg|http://ddr.lib.drake.edu/u?/ddarling,4545",,,,,,,,,,,,,,,,,,,,,,,,,,,,,,,,,,,,,,,,,,,,,,,,"<a href=""http://ddr.lib.drake.edu/u?/ddarling,4545"" target=""_blank"">View this item in its source respository</a>",,,,,,,,,,,,,,,,,,,,,,,,,,,,,https://www.iowaheritage.org/files/original/dfd79c22a393792579885d1f09310077.jpg,"Remote Item","Editorial Cartoons of J.N. ""Ding"" Darling, Drake University",1,0
16661,https://www.iowaheritage.org/items/show/16661,"Log house, China, 1944","Log buildings|China|1940-1950|Trees",,unidentified,,"University of Iowa. Libraries. Special Collections Dept.",1944|2009-02-18,,"Educational use only, no other permissions given. U.S. and international copyright laws may protect this item. Commercial use or distribution of this digital object is not permitted without written permission of the University of Iowa Special Collections Dept.","Henry A. Wallace Collection|Henry Agard Wallace papers|http://lib.uiowa.edu/collguides/?MSC0177|Photographs & images|China-Siberia Trip, 1944|Scanned with Ricoh 3228C scanner at 600 ppi. Archival tiff available.",jpeg,,"Still image|Photographs",MSC0177|7|50|wal73-050.jpg|https://digital.lib.uiowa.edu/,,,,,,,,,,,,,,,,,,,,,,,,,,,,,,,,,,,,,,,,,,,,,,,,"<a href=""https://digital.lib.uiowa.edu/"" target=""_blank"">View this item in its source respository</a>",,,,,,,,,,,,,,,,,,,,,,,,,,,,,https://www.iowaheritage.org/files/original/032ba7d513587514e2ede895ca6d922a.jpg,"Remote Item","Henry A. Wallace Collection",1,0
3825,https://www.iowaheritage.org/items/show/3825,"Looking at it from inside.","War|Post-World War, 1914-1918|Italy|Cage.|peace|international relations|League of Nations|sovereignty.|China|Germany|Pacific Islands|Russia|France|England",,"Darling, Jay N. (Jay Norwood), 1876-1962","The Editorial cartoons of J.N. ""Ding"" Darling [electronic resource] : The Cowles Collection, Drake University, 1912-1962",,1919/02/27|1919,,"Copyright is owned by the ""Ding"" Darling Wildlife Society; it is administered on behalf of the Society by The University of Iowa. While use within the classroom is encouraged without specific authorization, publishing this cartoon in any format requires written permission. See policy and permissions procedure at: http://www.lib.uiowa.edu/spec-coll/services/dingdarling_fees.html","Cowles Library, Drake University, 2507 University Ave., Des Moines, IA 50311-4505.",,,,"190227.jpg|http://ddr.lib.drake.edu/u?/ddarling,954",,,,,,,,,,,,,,,,,,,,,,,,,,,,,,,,,,,,,,,,,,,,,,,,"<a href=""http://ddr.lib.drake.edu/u?/ddarling,954"" target=""_blank"">View this item in its source respository</a>",,,,,,,,,,,,,,,,,,,,,,,,,,,,,https://www.iowaheritage.org/files/original/2d2f8810b08faa0d01960270190b1931.jpg,"Remote Item","Editorial Cartoons of J.N. ""Ding"" Darling, Drake University",1,0
9259,https://www.iowaheritage.org/items/show/9259,"Making one shoe that will fit the whole family is no easy job.","War|World War, 1939-1945|Poland|Uncle Sam|peace|agreements|treaties|United Nations|postwar|Balkans|Russia|United States|England|India|China|Latin America|France|San Francisco, California|John Bull.",,"Darling, Jay N. (Jay Norwood), 1876-1962","The Editorial cartoons of J.N. ""Ding"" Darling [electronic resource] : The Cowles Collection, Drake University, 1912-1962",,1945/05/23|1945,,"Copyright is owned by the ""Ding"" Darling Wildlife Society; it is administered on behalf of the Society by The University of Iowa. While use within the classroom is encouraged without specific authorization, publishing this cartoon in any format requires written permission. See policy and permissions procedure at: http://www.lib.uiowa.edu/spec-coll/services/dingdarling_fees.html","Cowles Library, Drake University, 2507 University Ave., Des Moines, IA 50311-4505.",,,,"450523.jpg|http://ddr.lib.drake.edu/u?/ddarling,6189",,,,,,,,,,,,,,,,,,,,,,,,,,,,,,,,,,,,,,,,,,,,,,,,"<a href=""http://ddr.lib.drake.edu/u?/ddarling,6189"" target=""_blank"">View this item in its source respository</a>",,,,,,,,,,,,,,,,,,,,,,,,,,,,,https://www.iowaheritage.org/files/original/1c0efa904d2e8ce075c7f2d3d5a2a13a.jpg,"Remote Item","Editorial Cartoons of J.N. ""Ding"" Darling, Drake University",1,0
3472,https://www.iowaheritage.org/items/show/3472,"Making themselves right at home.","International relations|United States|Uncle Sam|international trade|imperialism|China|Japan|picnic.",,"Darling, Jay N. (Jay Norwood), 1876-1962","The Editorial cartoons of J.N. ""Ding"" Darling [electronic resource] : The Cowles Collection, Drake University, 1912-1962",,1917/11/18|1917,,"Copyright is owned by the ""Ding"" Darling Wildlife Society; it is administered on behalf of the Society by The University of Iowa. While use within the classroom is encouraged without specific authorization, publishing this cartoon in any format requires written permission. See policy and permissions procedure at: http://www.lib.uiowa.edu/spec-coll/services/dingdarling_fees.html","Cowles Library, Drake University, 2507 University Ave., Des Moines, IA 50311-4505.",,,,"171118.jpg|http://ddr.lib.drake.edu/u?/ddarling,601",,,,,,,,,,,,,,,,,,,,,,,,,,,,,,,,,,,,,,,,,,,,,,,,"<a href=""http://ddr.lib.drake.edu/u?/ddarling,601"" target=""_blank"">View this item in its source respository</a>",,,,,,,,,,,,,,,,,,,,,,,,,,,,,https://www.iowaheritage.org/files/original/414960ac22b4100f53be9136827f8639.jpg,"Remote Item","Editorial Cartoons of J.N. ""Ding"" Darling, Drake University",1,0
16589,https://www.iowaheritage.org/items/show/16589,"Man and boy walking on a path, China, 1944",Men|China|1940-1950|Boys,,unidentified,,"University of Iowa. Libraries. Special Collections Dept.",1944|2009-02-18,,"Educational use only, no other permissions given. U.S. and international copyright laws may protect this item. Commercial use or distribution of this digital object is not permitted without written permission of the University of Iowa Special Collections Dept.","Henry A. Wallace Collection|Henry Agard Wallace papers|http://lib.uiowa.edu/collguides/?MSC0177|7|China-Siberia Trip, 1944|Scanned with Ricoh 3228C scanner at 600 ppi. Archival tiff available.",jpeg|5|7,,"Still image|Photographs","MSC0177|Print 8|wal73-008.jpg|https://digital.lib.uiowa.edu/",,,,,,,,,,,,,,,,,,,,,,,,,,,,,,,,,,,,,,,,,,,,,,,,"<a href=""https://digital.lib.uiowa.edu/"" target=""_blank"">View this item in its source respository</a>",,,,,,,,,,,,,,,,,,,,,,,,,,,,,https://www.iowaheritage.org/files/original/dd5a1eeb08cba2d298e8c499ad1569b4.jpg,"Remote Item","Henry A. Wallace Collection",1,0
16968,https://www.iowaheritage.org/items/show/16968,"Man holding fur, China, 1944","Men|China|1940-1950|Fur|Hides & skins",,unidentified,,"University of Iowa. Libraries. Special Collections Dept.",1944|2004-08-27,,"Educational use only, no other permissions given. U.S. and international copyright laws may protect this item. Commercial use or distribution of this digital object is not permitted without written permission of the University of Iowa Special Collections Dept.","Henry A. Wallace Collection|Henry Agard Wallace papers|http://lib.uiowa.edu/collguides/?MSC0177|Photographs & images|Scanned with Ricoh 3228C scanner at 600 ppi. Archival tiff available.",jpeg,,"Still image|Photographs",MSC0177|1|wal73cd-49.jpg|https://digital.lib.uiowa.edu/,,,,,,,,,,,,,,,,,,,,,,,,,,,,,,,,,,,,,,,,,,,,,,,,"<a href=""https://digital.lib.uiowa.edu/"" target=""_blank"">View this item in its source respository</a>",,,,,,,,,,,,,,,,,,,,,,,,,,,,,https://www.iowaheritage.org/files/original/37dce5bb3232b793a1531a2c28b03adc.jpg,"Remote Item","Henry A. Wallace Collection",1,0
16679,https://www.iowaheritage.org/items/show/16679,"Man on camel with herd of horses, China, 1944",Horses|China|1940-1950|Camels,,unidentified,,"University of Iowa. Libraries. Special Collections Dept.",1944|2009-02-18,,"Educational use only, no other permissions given. U.S. and international copyright laws may protect this item. Commercial use or distribution of this digital object is not permitted without written permission of the University of Iowa Special Collections Dept.","Henry A. Wallace Collection|Henry Agard Wallace papers|http://lib.uiowa.edu/collguides/?MSC0177|Photographs & images|China-Siberia Trip, 1944|Scanned with Ricoh 3228C scanner at 600 ppi. Archival tiff available.",jpeg,,"Still image|Photographs",MSC0177|7|59|wal73-059.jpg|https://digital.lib.uiowa.edu/,,,,,,,,,,,,,,,,,,,,,,,,,,,,,,,,,,,,,,,,,,,,,,,,"<a href=""https://digital.lib.uiowa.edu/"" target=""_blank"">View this item in its source respository</a>",,,,,,,,,,,,,,,,,,,,,,,,,,,,,https://www.iowaheritage.org/files/original/aa8a00406c4461de0d7444f46c20ddce.jpg,"Remote Item","Henry A. Wallace Collection",1,0
16953,https://www.iowaheritage.org/items/show/16953,"Man on camel, China, 1944",Men|Chinese|China|1940-1950|Camels|Horses,,unidentified,,"University of Iowa. Libraries. Special Collections Dept.",1944|2004-08-27,,"Educational use only, no other permissions given. U.S. and international copyright laws may protect this item. Commercial use or distribution of this digital object is not permitted without written permission of the University of Iowa Special Collections Dept.","Henry A. Wallace Collection|Henry Agard Wallace papers|http://lib.uiowa.edu/collguides/?MSC0177|Photographs & images|Scanned with Ricoh 3228C scanner at 600 ppi. Archival tiff available.",jpeg,,"Still image|Photographs",MSC0177|1|wal73cd-42.jpg|https://digital.lib.uiowa.edu/,,,,,,,,,,,,,,,,,,,,,,,,,,,,,,,,,,,,,,,,,,,,,,,,"<a href=""https://digital.lib.uiowa.edu/"" target=""_blank"">View this item in its source respository</a>",,,,,,,,,,,,,,,,,,,,,,,,,,,,,https://www.iowaheritage.org/files/original/618953f2a29163dc6193b80100af318d.jpg,"Remote Item","Henry A. Wallace Collection",1,0
16867,https://www.iowaheritage.org/items/show/16867,"Man standing by drawing, China, 1944",Men|Chinese|China|1940-1950|Drawings|Buddhas|Calligraphy,,unidentified,,"University of Iowa. Libraries. Special Collections Dept.",1944|2009-02-20,,"Educational use only, no other permissions given. U.S. and international copyright laws may protect this item. Commercial use or distribution of this digital object is not permitted without written permission of the University of Iowa Special Collections Dept.","Henry A. Wallace Collection|Henry Agard Wallace papers|http://lib.uiowa.edu/collguides/?MSC0177|Photographs & images|China-Siberia Trip, 1944|Scanned with Ricoh 3228C scanner at 600 ppi. Archival tiff available.",jpeg,,"Still image|Photographs",MSC0177|7|556|wal73-156.jpg|https://digital.lib.uiowa.edu/,,,,,,,,,,,,,,,,,,,,,,,,,,,,,,,,,,,,,,,,,,,,,,,,"<a href=""https://digital.lib.uiowa.edu/"" target=""_blank"">View this item in its source respository</a>",,,,,,,,,,,,,,,,,,,,,,,,,,,,,https://www.iowaheritage.org/files/original/80a50b6485f366ee0ee7bf8d484db131.jpg,"Remote Item","Henry A. Wallace Collection",1,0
