 




﻿"Item Id","Item URI","Dublin Core:Title","Dublin Core:Subject","Dublin Core:Description","Dublin Core:Creator","Dublin Core:Source","Dublin Core:Publisher","Dublin Core:Date","Dublin Core:Contributor","Dublin Core:Rights","Dublin Core:Relation","Dublin Core:Format","Dublin Core:Language","Dublin Core:Type","Dublin Core:Identifier","Dublin Core:Coverage","Item Type Metadata:Text","Item Type Metadata:Interviewer","Item Type Metadata:Interviewee","Item Type Metadata:Location","Item Type Metadata:Transcription","Item Type Metadata:Local URL","Item Type Metadata:Original Format","Item Type Metadata:Physical Dimensions","Item Type Metadata:Duration","Item Type Metadata:Compression","Item Type Metadata:Producer","Item Type Metadata:Director","Item Type Metadata:Bit Rate/Frequency","Item Type Metadata:Time Summary","Item Type Metadata:Email Body","Item Type Metadata:Subject Line","Item Type Metadata:From","Item Type Metadata:To","Item Type Metadata:CC","Item Type Metadata:BCC","Item Type Metadata:Number of Attachments","Item Type Metadata:Standards","Item Type Metadata:Objectives","Item Type Metadata:Materials","Item Type Metadata:Lesson Plan Text","Item Type Metadata:URL","Item Type Metadata:Event Type","Item Type Metadata:Participants","Item Type Metadata:Birth Date","Item Type Metadata:Birthplace","Item Type Metadata:Death Date","Item Type Metadata:Occupation","Item Type Metadata:Biographical Text","Item Type Metadata:Bibliography","Item Type Metadata:Digital Reproduction Information","Item Type Metadata:Repository","Item Type Metadata:Repository Collection","Item Type Metadata:Contact information.","Item Type Metadata:File Name","Item Type Metadata:Notes","Item Type Metadata:Digital item created","Item Type Metadata:Digital item modified","Item Type Metadata:Executive Orders","Item Type Metadata:Record Created","Item Type Metadata:Record Modified","Item Type Metadata:Transcription2","Item Type Metadata:Source URL","Omeka Legacy File:Additional Creator","Omeka Legacy File:Transcriber","Omeka Legacy File:Producer","Omeka Legacy File:Render Device","Omeka Legacy File:Render Details","Omeka Legacy File:Capture Date","Omeka Legacy File:Capture Device","Omeka Legacy File:Capture Details","Omeka Legacy File:Change History","Omeka Legacy File:Watermark","Omeka Legacy File:Encryption","Omeka Legacy File:Compression","Omeka Legacy File:Post Processing","Omeka Image File:Width","Omeka Image File:Height","Omeka Image File:Bit Depth","Omeka Image File:Channels","Omeka Image File:Exif String","Omeka Image File:Exif Array","Omeka Image File:IPTC String","Omeka Image File:IPTC Array","Omeka Video File:Bitrate","Omeka Video File:Duration","Omeka Video File:Sample Rate","Omeka Video File:Codec","Omeka Video File:Width","Omeka Video File:Height",tags,file,itemType,collection,public,featured
98345,https://www.iowaheritage.org/items/show/98345,"Lime loss from snow melt runoff on John Sutter's farm.","Appanoose County Soil and Water Conservation District","Lime loss from snow melt runoff on John Sutter's farm in Centerville, Iowa.","Appanoose County Soil and Water Conservation District",,"State Library of Iowa|Appanoose County Soil and Water Conservation District",,"Appanoose County Soil and Water Conservation District. For questions about copyright, contact the State Library of Iowa at  <a href=""http://www.statelibraryofiowa.org"">http://www.statelibraryofiowa.org</a>.","This item is protected by copyright and/or related rights. Your are free to use this Item in any way that is permitted by the copyright and related rights legislation that applies to your use. For other uses you need to obtain permission from the rights-holder(s). <a href=""http://rightsstatements.org/"">http://rightsstatements.org</a>",,jpg,eng,"Still Image; Photograph ",,,,,,,,,,,,,,,,,,,,,,,,,,,,,,,,,,,,,,,,,,,,,,,,,,,,,,,,,,,,,,,,,,,,,,,,,,,,,"Appanoose County,Centerville Iowa,Lime Loss,Runoff,Winter Melt",https://www.iowaheritage.org/files/original/e0b8a6e5462400577207c88abf4b818d.jpg,"Still Image","Appanoose County Soil and Water Conservation District Historic Collection",1,0
98346,https://www.iowaheritage.org/items/show/98346,"Sculpting land at Durree's farms.","Appanoose County Soil and Water Conservation District","Sculpting land at Durree's farms.","Appanoose County Soil and Water Conservation District",,"State Library of Iowa|Appanoose County Soil and Water Conservation District",1954,"Appanoose County Soil and Water Conservation District. For questions about copyright, contact the State Library of Iowa at  <a href=""http://www.statelibraryofiowa.org"">http://www.statelibraryofiowa.org</a>.","This item is protected by copyright and/or related rights. Your are free to use this Item in any way that is permitted by the copyright and related rights legislation that applies to your use. For other uses you need to obtain permission from the rights-holder(s). <a href=""http://rightsstatements.org/"">http://rightsstatements.org</a>",,jpg,eng,"Still Image; Photograph ",,,,,,,,,,,,,,,,,,,,,,,,,,,,,,,,,,,,,,,,,,,,,,,,,,,,,,,,,,,,,,,,,,,,,,,,,,,,,"Appanoose County,Dozer",https://www.iowaheritage.org/files/original/a70d3f2a28555cf98e9664c9cdc1c3f5.jpg,"Still Image","Appanoose County Soil and Water Conservation District Historic Collection",1,0
98347,https://www.iowaheritage.org/items/show/98347,"Diversion on the Richard Tubaugh's farm.","Appanoose County Soil and Water Conservation District","Diversion on the Richard Tubaugh's farm.","Appanoose County Soil and Water Conservation District",,"State Library of Iowa|Appanoose County Soil and Water Conservation District",08-09-1954,"Appanoose County Soil and Water Conservation District. For questions about copyright, contact the State Library of Iowa at  <a href=""http://www.statelibraryofiowa.org"">http://www.statelibraryofiowa.org</a>.","This item is protected by copyright and/or related rights. Your are free to use this Item in any way that is permitted by the copyright and related rights legislation that applies to your use. For other uses you need to obtain permission from the rights-holder(s). <a href=""http://rightsstatements.org/"">http://rightsstatements.org</a>",,jpg,eng,"Still Image; Photograph ",,,,,,,,,,,,,,,,,,,,,,,,,,,,,,,,,,,,,,,,,,,,,,,,,,,,,,,,,,,,,,,,,,,,,,,,,,,,,"Appanoose County,Diversion,Richard Tubaugh",https://www.iowaheritage.org/files/original/c8b173051218c210fa9080cf86b4d51f.jpg,"Still Image","Appanoose County Soil and Water Conservation District Historic Collection",1,0
98444,https://www.iowaheritage.org/items/show/98444,"Reverend Henry Herman Fritz.","Appanoose County Soil and Water Conservation District","Reverend Henry Herman Fritz. Pastor of the First Christian Church at Moulton, Iowa.","Appanoose County Soil and Water Conservation District",,"State Library of Iowa|Appanoose County Soil and Water Conservation District",1961,"Appanoose County Soil and Water Conservation District. For questions about copyright, contact the State Library of Iowa at  <a href=""http://www.statelibraryofiowa.org"">http://www.statelibraryofiowa.org</a>.","This item is protected by copyright and/or related rights. Your are free to use this Item in any way that is permitted by the copyright and related rights legislation that applies to your use. For other uses you need to obtain permission from the rights-holder(s). <a href=""http://rightsstatements.org/"">http://rightsstatements.org</a>",,jpg,eng,"Still Image; Photograph ",,,,,,,,,,,,,,,,,,,,,,,,,,,,,,,,,,,,,,,,,AppanooseSWCD_ManOnCouch_1961.jpg,,,,,,,,,,,,,,,,,,,,,,,,,,,,,,,,,,,,"Appanoose County,First Christian Church,Moulton Iowa,Pastor,Reverend Henry Herman Fritz,Soil and Water Conservation",https://www.iowaheritage.org/files/original/dcaeade531f56bae8751618e14675cf0.jpg,"Still Image","Appanoose County Soil and Water Conservation District Historic Collection",1,0
98539,https://www.iowaheritage.org/items/show/98539,"Aerial photos of Appanoose County farmland.","Appanoose County Soil and Water Conservation District","Aerial photos of Appanoose County farmland.","Appanoose County Soil and Water Conservation District",,"State Library of Iowa|Appanoose Soil and Water Conservation District","Unknown ","Appanoose County Soil and Water Conservation District. For questions about copyright, contact the State Library of Iowa at  <a href=""http://www.statelibraryofiowa.org"">http://www.statelibraryofiowa.org</a>.","This item is protected by copyright and/or related rights. Your are free to use this Item in any way that is permitted by the copyright and related rights legislation that applies to your use. For other uses you need to obtain permission from the rights-holder(s). <a href=""http://rightsstatements.org/"">http://rightsstatements.org</a>",,pdf,eng,"Still Image; Photograph ",,,,,,,,,,,,,,,,,,,,,,,,,,,,,,,,,,,,,,,,,AppanooseSWCD_AerialImages.pdf,,,,,,,,,,,,,,,,,,,,,,,,,,,,,,,,,,,,"Appanoose County,Farmland",https://www.iowaheritage.org/files/original/4c207dcc9fb8ba93a9810a3411fa0a2b.pdf,"Still Image","Appanoose County Soil and Water Conservation District Historic Collection",1,0
99020,https://www.iowaheritage.org/items/show/99020,"Appanoose agricultural land  ","Appanoose County Soil and Water Conservation District|Agriculture|Cropland","B&W photograph series of aerial pictures of cropland in Appanoose County. (12)","Appanoose County Soil and Water Conservation District ",,"State Library of Iowa",Unknown,"Appanoose County Soil and Water Conservation District of Iowa. For questions about copyright, contact the State Library of Iowa at  <a href=""http://www.statelibraryofiowa.org"">http://www.statelibraryofiowa.org</a>.","This item is protected by copyright and/or related rights. Your are free to use this Item in any way that is permitted by the copyright and related rights legislation that applies to your use. For other uses you need to obtain permission from the rights-holder(s). <a href=""http://rightsstatements.org/"">http://rightsstatements.org</a>",,jpg,,"Still Image; Photograph",,,,,,,,,,,,,,,,,,,,,,,,,,,,,,,,,,,,,,,,,Appanoose_aerial_agriculture_,,,,,,,,,,,,,,,,,,,,,,,,,,,,,,,,,,,,"Agriculture,Appanoose County Soil and Water Conservation District,Cropland,Photographs",https://www.iowaheritage.org/files/original/1df9d05ac2bc17345546e579b6c0e838.pdf,"Still Image","Appanoose County Soil and Water Conservation District Historic Collection",1,0
99021,https://www.iowaheritage.org/items/show/99021,"B-9, 1965","Appanoose County Soil and Water Conservation District|Flood Control","B&W photograph of ""after"" of structure B-9 on J. Daniels land.","Appanoose County Soil and Water Conservation District ",,"State Library of Iowa",1965-07-11,"Appanoose County Soil and Water Conservation District of Iowa. For questions about copyright, contact the State Library of Iowa at  <a href=""http://www.statelibraryofiowa.org"">http://www.statelibraryofiowa.org</a>.","This item is protected by copyright and/or related rights. Your are free to use this Item in any way that is permitted by the copyright and related rights legislation that applies to your use. For other uses you need to obtain permission from the rights-holder(s). <a href=""http://rightsstatements.org/"">http://rightsstatements.org</a>",,jpg,,"Still Image; Photograph",,,,,,,,,,,,,,,,,,,,,,,,,,,,,,,,,,,,,,,,,Appanoose_After_B-9_structure_001|Appanoose_After_B-9_structure_002,,,,,,,,,,,,,,,,,,,,,,,,,,,,,,,,,,,,"Appanoose County Soil and Water Conservation District,B-9,Flood Control","https://www.iowaheritage.org/files/original/47ec997d080a3418749f98ab325707d7.jpg,https://www.iowaheritage.org/files/original/820e71993c54dda6a940f7421f841f8f.jpg","Still Image","Appanoose County Soil and Water Conservation District Historic Collection",1,0
99022,https://www.iowaheritage.org/items/show/99022,"B-100 channel improvement, 1965","Appanoose County Soil and Water Conservation District|Concrete Weir|Flood Control","B&W photograph of ""after"" of structure B-100 channel completed on the upper east-weest section.","Appanoose County Soil and Water Conservation District ",,"State Library of Iowa",1965-07-11,"Appanoose County Soil and Water Conservation District of Iowa. For questions about copyright, contact the State Library of Iowa at  <a href=""http://www.statelibraryofiowa.org"">http://www.statelibraryofiowa.org</a>.","This item is protected by copyright and/or related rights. Your are free to use this Item in any way that is permitted by the copyright and related rights legislation that applies to your use. For other uses you need to obtain permission from the rights-holder(s). <a href=""http://rightsstatements.org/"">http://rightsstatements.org</a>",,jpg,,"Still Image; Photograph",,,,,,,,,,,,,,,,,,,,,,,,,,,,,,,,,,,,,,,,,After_B-100_Channel_Improvement_3|After_B-100_Channel_Improvement_4,,,,,,,,,,,,,,,,,,,,,,,,,,,,,,,,,,,,"Appanoose County Soil and Water Conservation District,B-100,Concrete Weir,Flood Control","https://www.iowaheritage.org/files/original/a3797244528a989b915548014e1bb6b9.jpg,https://www.iowaheritage.org/files/original/3e5df9e6d16722527e4401056d0f57e7.jpg","Still Image","Appanoose County Soil and Water Conservation District Historic Collection",1,0
99023,https://www.iowaheritage.org/items/show/99023,"E-11, 1965","Appanoose County Soil and Water Conservation District|Watershed|Moulton","B&W photograph of E-11 Moulton watershed after 18"" hood-inlet spillway replaces unsafe iron bridge. ","Appanoose County Soil and Water Conservation District ",,"State Library of Iowa",1965-07-11,"Appanoose County Soil and Water Conservation District of Iowa. For questions about copyright, contact the State Library of Iowa at  <a href=""http://www.statelibraryofiowa.org"">http://www.statelibraryofiowa.org</a>.","This item is protected by copyright and/or related rights. Your are free to use this Item in any way that is permitted by the copyright and related rights legislation that applies to your use. For other uses you need to obtain permission from the rights-holder(s). <a href=""http://rightsstatements.org/"">http://rightsstatements.org</a>",,jpg,,"Still Image; Photograph",,,,,,,,,,,,,,,,,,,,,,,,,,,,,,,,,,,,,,,,,Appanoose_After_E-11_structure_001|Appanoose_After_E-11_structure_002,,,,,,,,,,,,,,,,,,,,,,,,,,,,,,,,,,,,"Appanoose County Soil and Water Conservation District,E-11 Structure Site,Moulton,Watershed","https://www.iowaheritage.org/files/original/c38ffff3547e4c83fe27f49ce4311a2f.jpg,https://www.iowaheritage.org/files/original/8f925f97ac589b4e1f0677c6e190c10c.jpg","Still Image","Appanoose County Soil and Water Conservation District Historic Collection",1,0
99024,https://www.iowaheritage.org/items/show/99024,"Appanoose agricultural land","Appanoose County Soil and Water Conservation District|Agriculture","B&W photograph series of agricultural land in Appanoose County. (38)","Appanoose County Soil and Water Conservation District ",,"State Library of Iowa",Unknown,"Appanoose County Soil and Water Conservation District of Iowa. For questions about copyright, contact the State Library of Iowa at  <a href=""http://www.statelibraryofiowa.org"">http://www.statelibraryofiowa.org</a>.","This item is protected by copyright and/or related rights. Your are free to use this Item in any way that is permitted by the copyright and related rights legislation that applies to your use. For other uses you need to obtain permission from the rights-holder(s). <a href=""http://rightsstatements.org/"">http://rightsstatements.org</a>",,jpg,,"Still Image; Photograph",,,,,,,,,,,,,,,,,,,,,,,,,,,,,,,,,,,,,,,,,Appanoose_agricultural_land_,,,,,,,,,,,,,,,,,,,,,,,,,,,,,,,,,,,,"Agriculture,Appanoose County Soil and Water Conservation District,Photographs",https://www.iowaheritage.org/files/original/466fef458da827da84bd8599da3892fe.pdf,"Still Image","Appanoose County Soil and Water Conservation District Historic Collection",1,0
