 




﻿"Item Id","Item URI","Dublin Core:Title","Dublin Core:Subject","Dublin Core:Description","Dublin Core:Creator","Dublin Core:Source","Dublin Core:Publisher","Dublin Core:Date","Dublin Core:Contributor","Dublin Core:Rights","Dublin Core:Relation","Dublin Core:Format","Dublin Core:Language","Dublin Core:Type","Dublin Core:Identifier","Dublin Core:Coverage","Item Type Metadata:Text","Item Type Metadata:Interviewer","Item Type Metadata:Interviewee","Item Type Metadata:Location","Item Type Metadata:Transcription","Item Type Metadata:Local URL","Item Type Metadata:Original Format","Item Type Metadata:Physical Dimensions","Item Type Metadata:Duration","Item Type Metadata:Compression","Item Type Metadata:Producer","Item Type Metadata:Director","Item Type Metadata:Bit Rate/Frequency","Item Type Metadata:Time Summary","Item Type Metadata:Email Body","Item Type Metadata:Subject Line","Item Type Metadata:From","Item Type Metadata:To","Item Type Metadata:CC","Item Type Metadata:BCC","Item Type Metadata:Number of Attachments","Item Type Metadata:Standards","Item Type Metadata:Objectives","Item Type Metadata:Materials","Item Type Metadata:Lesson Plan Text","Item Type Metadata:URL","Item Type Metadata:Event Type","Item Type Metadata:Participants","Item Type Metadata:Birth Date","Item Type Metadata:Birthplace","Item Type Metadata:Death Date","Item Type Metadata:Occupation","Item Type Metadata:Biographical Text","Item Type Metadata:Bibliography","Item Type Metadata:Digital Reproduction Information","Item Type Metadata:Repository","Item Type Metadata:Repository Collection","Item Type Metadata:Contact information.","Item Type Metadata:File Name","Item Type Metadata:Notes","Item Type Metadata:Digital item created","Item Type Metadata:Digital item modified","Item Type Metadata:Executive Orders","Item Type Metadata:Record Created","Item Type Metadata:Record Modified","Item Type Metadata:Transcription2","Item Type Metadata:Source URL","Omeka Legacy File:Additional Creator","Omeka Legacy File:Transcriber","Omeka Legacy File:Producer","Omeka Legacy File:Render Device","Omeka Legacy File:Render Details","Omeka Legacy File:Capture Date","Omeka Legacy File:Capture Device","Omeka Legacy File:Capture Details","Omeka Legacy File:Change History","Omeka Legacy File:Watermark","Omeka Legacy File:Encryption","Omeka Legacy File:Compression","Omeka Legacy File:Post Processing","Omeka Image File:Width","Omeka Image File:Height","Omeka Image File:Bit Depth","Omeka Image File:Channels","Omeka Image File:Exif String","Omeka Image File:Exif Array","Omeka Image File:IPTC String","Omeka Image File:IPTC Array","Omeka Video File:Bitrate","Omeka Video File:Duration","Omeka Video File:Sample Rate","Omeka Video File:Codec","Omeka Video File:Width","Omeka Video File:Height",tags,file,itemType,collection,public,featured
12093,https://www.iowaheritage.org/items/show/12093,"Flooding behind Burge Residence Hall and around Iowa Memorial Union, The University of Iowa, June 14, 2008","Floods|University of Iowa|United States -- Iowa -- Iowa City|2000-2010|Evacuations|Disaster relief|Rivers|Educational facilities|Student Unions|","Floodwater rises near Burge Residence Hall and flood Iowa Memorial Union on Saturday, June 14, 2008.","Schoon, Tim",,"University of Iowa. University News Services",2008-06-14|2008-06-14,,"Educational use only, no other permissions given. U.S. and international copyright laws may protect this item. Commercial use or distribution of this digital object is not permitted without written permission of the copyright holder.","Iowa City Flood|Flood Images|Flood preparations, June 14, 2008",jpeg,,"Still image|Photographs",https://digital.lib.uiowa.edu/,,,,,,,,,,,,,,,,,,,,,,,,,,,,,,,,,,,,,,,,,,,,,,,,"<a href=""https://digital.lib.uiowa.edu/"" target=""_blank"">View this item in its source respository</a>",,,,,,,,,,,,,,,,,,,,,,,,,,,,,https://www.iowaheritage.org/files/original/03f42f9a7aceede5c5bc8dbeea298232.jpg,"Remote Item","Iowa City Flood",1,0
12086,https://www.iowaheritage.org/items/show/12086,"Iowa River flooding near Burlington Street bridge, The University of Iowa, June 14, 2008","Floods|University of Iowa|United States -- Iowa -- Iowa City|2000-2010|Evacuations|Disaster relief|Rivers|United States -- Iowa -- Iowa River","Onlookers watch the Iowa River near the Burlington Street bridge on Saturday, June 14, 2008.","Schoon, Tim",,"University of Iowa. University News Services",2008-06-14|2008-06-14,,"Educational use only, no other permissions given. U.S. and international copyright laws may protect this item. Commercial use or distribution of this digital object is not permitted without written permission of the copyright holder.","Iowa City Flood|Flood Images|Flood preparations, June 14, 2008",jpeg,,"Still image|Photographs",https://digital.lib.uiowa.edu/,,,,,,,,,,,,,,,,,,,,,,,,,,,,,,,,,,,,,,,,,,,,,,,,"<a href=""https://digital.lib.uiowa.edu/"" target=""_blank"">View this item in its source respository</a>",,,,,,,,,,,,,,,,,,,,,,,,,,,,,https://www.iowaheritage.org/files/original/800b983e11bfb592bd3c6ef09a6a0780.jpg,"Remote Item","Iowa City Flood",1,0
12073,https://www.iowaheritage.org/items/show/12073,"Iowa River floods near Burlington Street bridge, The University of Iowa, June 12, 2008","Floods|University of Iowa|United States -- Iowa -- Iowa City|2000-2010|Evacuations|Disaster relief|Rivers|United States -- Iowa -- Iowa River","Iowa River floods near Burlington Street bridge Thursday, June 12, 2008.","Schoon, Tim",,"University of Iowa. University News Services",2008-06-12|2008-06-12,,"Educational use only, no other permissions given. U.S. and international copyright laws may protect this item. Commercial use or distribution of this digital object is not permitted without written permission of the copyright holder.","Iowa City Flood|Flood Images|Flood, June 12, 2008",jpeg,,"Still image|Photographs",https://digital.lib.uiowa.edu/,,,,,,,,,,,,,,,,,,,,,,,,,,,,,,,,,,,,,,,,,,,,,,,,"<a href=""https://digital.lib.uiowa.edu/"" target=""_blank"">View this item in its source respository</a>",,,,,,,,,,,,,,,,,,,,,,,,,,,,,https://www.iowaheritage.org/files/original/16c397dcdbfc82e076ae702cea6a4e1d.jpg,"Remote Item","Iowa City Flood",1,0
12004,https://www.iowaheritage.org/items/show/12004,"Floodwater rising, The University of Iowa, June 12, 2008","Floods|University of Iowa|United States -- Iowa -- Iowa City|2000-2010|Evacuations|Disaster relief|Educational facilities|Rivers|Old Capitol (Iowa City, Iowa)|United States -- Iowa -- Iowa River","The Iowa River continues to rise on Thursday, June 12, 2008.","Schoon, Tim",,"University of Iowa. University News Services",2008-06-12|2008-06-12,,"Educational use only, no other permissions given. U.S. and international copyright laws may protect this item. Commercial use or distribution of this digital object is not permitted without written permission of the copyright holder.","Iowa City Flood|Flood Images|Flood, June 12, 2008",jpeg,,"Still image|Photographs",https://digital.lib.uiowa.edu/,,,,,,,,,,,,,,,,,,,,,,,,,,,,,,,,,,,,,,,,,,,,,,,,"<a href=""https://digital.lib.uiowa.edu/"" target=""_blank"">View this item in its source respository</a>",,,,,,,,,,,,,,,,,,,,,,,,,,,,,https://www.iowaheritage.org/files/original/5ac3c904e7f7b4902f5f20d12fc771f3.jpg,"Remote Item","Iowa City Flood",1,0
11940,https://www.iowaheritage.org/items/show/11940,"Iowa River floods near Iowa Memorial Union, The University of Iowa, June 12, 2008","Floods|University of Iowa|United States -- Iowa -- Iowa City|2000-2010|Evacuations|Disaster relief|Rivers|Student Unions||Iowa Memorial Union (Iowa City, Iowa)|United States -- Iowa -- Iowa River","Iowa River floods near the Iowa Memorial Union on Thursday, June 12, 2008.","Schoon, Tim",,"University of Iowa. University News Services",2008-06-12|2008-06-12,,"Educational use only, no other permissions given. U.S. and international copyright laws may protect this item. Commercial use or distribution of this digital object is not permitted without written permission of the copyright holder.","Iowa City Flood|Flood Images|Flood, June 12, 2008",jpeg,,"Still image|Photographs",https://digital.lib.uiowa.edu/,,,,,,,,,,,,,,,,,,,,,,,,,,,,,,,,,,,,,,,,,,,,,,,,"<a href=""https://digital.lib.uiowa.edu/"" target=""_blank"">View this item in its source respository</a>",,,,,,,,,,,,,,,,,,,,,,,,,,,,,https://www.iowaheritage.org/files/original/92499eba1f3d377ab79dc3cb2bfb96e2.jpg,"Remote Item","Iowa City Flood",1,0
11912,https://www.iowaheritage.org/items/show/11912,"Iowa River flooding near Dubuque Street, The University of Iowa, June 14, 2008","Floods|University of Iowa|United States -- Iowa -- Iowa City|2000-2010|Evacuations|Disaster relief|Rivers|United States -- Iowa -- Iowa River","Iowa River flooding near Dubuque Street on Saturday, June 14, 2008.","Schoon, Tim",,"University of Iowa. University News Services",2008-06-14|2008-06-14,,"Educational use only, no other permissions given. U.S. and international copyright laws may protect this item. Commercial use or distribution of this digital object is not permitted without written permission of the copyright holder.","Iowa City Flood|Flood Images|Flood preparations, June 14, 2008",jpeg,,"Still image|Photographs",https://digital.lib.uiowa.edu/,,,,,,,,,,,,,,,,,,,,,,,,,,,,,,,,,,,,,,,,,,,,,,,,"<a href=""https://digital.lib.uiowa.edu/"" target=""_blank"">View this item in its source respository</a>",,,,,,,,,,,,,,,,,,,,,,,,,,,,,https://www.iowaheritage.org/files/original/5af2b2470d1ce8b9e1baaa801575e1db.jpg,"Remote Item","Iowa City Flood",1,0
11884,https://www.iowaheritage.org/items/show/11884,"Iowa River floods Dubuque Street, The University of Iowa, June 14, 2008","Floods|University of Iowa|United States -- Iowa -- Iowa City|2000-2010|Evacuations|Disaster relief|Rivers||United States -- Iowa -- Iowa River","The Iowa River floods Dubuque Street in Iowa City on Saturday, June 14, 2008.","Schoon, Tim",,"University of Iowa. University News Services",2008-06-14|2008-06-14,,"Educational use only, no other permissions given. U.S. and international copyright laws may protect this item. Commercial use or distribution of this digital object is not permitted without written permission of the copyright holder.","Iowa City Flood|Flood Images|Flood preparations, June 14, 2008",jpeg,,"Still image|Photographs",https://digital.lib.uiowa.edu/,,,,,,,,,,,,,,,,,,,,,,,,,,,,,,,,,,,,,,,,,,,,,,,,"<a href=""https://digital.lib.uiowa.edu/"" target=""_blank"">View this item in its source respository</a>",,,,,,,,,,,,,,,,,,,,,,,,,,,,,https://www.iowaheritage.org/files/original/33b6be8bb682cd3881d8b7778312caff.jpg,"Remote Item","Iowa City Flood",1,0
11882,https://www.iowaheritage.org/items/show/11882,"Rising river level outside the Iowa Memorial Union, The University of Iowa, June 10, 2008","Floods|University of Iowa|United States -- Iowa -- Iowa City|2000-2010|Evacuations|Disaster relief|Rivers|Iowa Memorial Union (Iowa City, Iowa)|United States -- Iowa -- Iowa River","The Iowa River rises over an adjacent sidewalk outside the Iowa Memorial Union on  Wednesday, June 10, 2008.","Schoon, Tim",,"University of Iowa. University News Services",2008-06-10|2008-06-10,,"Educational use only, no other permissions given. U.S. and international copyright laws may protect this item. Commercial use or distribution of this digital object is not permitted without written permission of the copyright holder.","Iowa City Flood|Flood Images|Campus Flooding, June 10, 2008",jpeg,,"Still image|Photographs",https://digital.lib.uiowa.edu/,,,,,,,,,,,,,,,,,,,,,,,,,,,,,,,,,,,,,,,,,,,,,,,,"<a href=""https://digital.lib.uiowa.edu/"" target=""_blank"">View this item in its source respository</a>",,,,,,,,,,,,,,,,,,,,,,,,,,,,,https://www.iowaheritage.org/files/original/664e357ddbdb746603d222adfae2160b.jpg,"Remote Item","Iowa City Flood",1,0
49811,https://www.iowaheritage.org/items/show/49811,"Shell Rock River Dam Workers","Works Progress Administration|Shell Rock River|Rivers","WPA dams on Shell Rock River","Safford Lock",,,26-Sep-36,,,,"4 x 5 B&W photographic negative",,"Still Image",,,,,,,,,,,,,,,,,,,,,,,,,,,,,,,,,,,,,,,,,,,,,,,,,,,,,,,,,,,,,,,,,,,,,,,,,,,,,,https://www.iowaheritage.org/files/original/f68abeba71fe723513010b4c863e254e.jpg,"Still Image","Mason City Public Library Photograph Collection",1,0
49801,https://www.iowaheritage.org/items/show/49801,"Shell Rock River Dam Construction","Works Progress Administration|Shell Rock River|rivers","WPA dams on Shell Rock River","Safford Lock",,,26-Sep-36,,"This digital image may be used for educational purposes, as long as it is not altered in any way.  No commercial reproduction or distribution of this file is permitted without written permission of the Mason City Public Library.  High-quality reproductions are available.  For permission and a fee schedule, contact the library at archive@mcpl.org.",,"4 x 5 B&W photographic negative",,"Still image",,,,,,,,,,,,,,,,,,,,,,,,,,,,,,,,,,,,,,,,,,,,,,,,,,,,,,,,,,,,,,,,,,,,,,,,,,,,,,https://www.iowaheritage.org/files/original/a421bc3c0f49507a7940c5f47f2e1490.jpg,"Still Image","Mason City Public Library Photograph Collection",1,0
