 




﻿"Item Id","Item URI","Dublin Core:Title","Dublin Core:Subject","Dublin Core:Description","Dublin Core:Creator","Dublin Core:Source","Dublin Core:Publisher","Dublin Core:Date","Dublin Core:Contributor","Dublin Core:Rights","Dublin Core:Relation","Dublin Core:Format","Dublin Core:Language","Dublin Core:Type","Dublin Core:Identifier","Dublin Core:Coverage","Item Type Metadata:Text","Item Type Metadata:Interviewer","Item Type Metadata:Interviewee","Item Type Metadata:Location","Item Type Metadata:Transcription","Item Type Metadata:Local URL","Item Type Metadata:Original Format","Item Type Metadata:Physical Dimensions","Item Type Metadata:Duration","Item Type Metadata:Compression","Item Type Metadata:Producer","Item Type Metadata:Director","Item Type Metadata:Bit Rate/Frequency","Item Type Metadata:Time Summary","Item Type Metadata:Email Body","Item Type Metadata:Subject Line","Item Type Metadata:From","Item Type Metadata:To","Item Type Metadata:CC","Item Type Metadata:BCC","Item Type Metadata:Number of Attachments","Item Type Metadata:Standards","Item Type Metadata:Objectives","Item Type Metadata:Materials","Item Type Metadata:Lesson Plan Text","Item Type Metadata:URL","Item Type Metadata:Event Type","Item Type Metadata:Participants","Item Type Metadata:Birth Date","Item Type Metadata:Birthplace","Item Type Metadata:Death Date","Item Type Metadata:Occupation","Item Type Metadata:Biographical Text","Item Type Metadata:Bibliography","Item Type Metadata:Digital Reproduction Information","Item Type Metadata:Repository","Item Type Metadata:Repository Collection","Item Type Metadata:Contact information.","Item Type Metadata:File Name","Item Type Metadata:Notes","Item Type Metadata:Digital item created","Item Type Metadata:Digital item modified","Item Type Metadata:Executive Orders","Item Type Metadata:Record Created","Item Type Metadata:Record Modified","Item Type Metadata:Transcription2","Item Type Metadata:Source URL","Omeka Legacy File:Additional Creator","Omeka Legacy File:Transcriber","Omeka Legacy File:Producer","Omeka Legacy File:Render Device","Omeka Legacy File:Render Details","Omeka Legacy File:Capture Date","Omeka Legacy File:Capture Device","Omeka Legacy File:Capture Details","Omeka Legacy File:Change History","Omeka Legacy File:Watermark","Omeka Legacy File:Encryption","Omeka Legacy File:Compression","Omeka Legacy File:Post Processing","Omeka Image File:Width","Omeka Image File:Height","Omeka Image File:Bit Depth","Omeka Image File:Channels","Omeka Image File:Exif String","Omeka Image File:Exif Array","Omeka Image File:IPTC String","Omeka Image File:IPTC Array","Omeka Video File:Bitrate","Omeka Video File:Duration","Omeka Video File:Sample Rate","Omeka Video File:Codec","Omeka Video File:Width","Omeka Video File:Height",tags,file,itemType,collection,public,featured
41253,http://www.iowaheritage.org/items/show/41253,"Atlas of Winnebago County, Iowa","United States|Iowa|Winnebago County|1900-1910",,,,"Midland Map Co.|State Historical Society of Iowa (Iowa City)",1905|2008-07-15,,"No commercial reproduction or distribution of this file is permitted without permission.","Iowa Counties Historic Atlases|Atlas of Winnebago County, Iowa (Knoxville, IA: Midland Map Co., 1905)","1 atlas : 35 p. ; 35 cm.",English,"Still Image; Text|jp2","Winnebago County 1905|168474626|https://digital.lib.uiowa.edu/",,,,,,,,,,,,,,,,,,,,,,,,,,,,,,,,,,,,,,,,,,,,,,,,"<a href=""https://digital.lib.uiowa.edu/"" target=""_blank"">View this item in its source respository</a>",,,,,,,,,,,,,,,,,,,,,,,,,,,,,http://www.iowaheritage.org/files/original/a2b779cbd7a4209cb5898032ccf074a8.jpg,"Remote Item","Iowa Counties Historic Atlases",1,0
41589,http://www.iowaheritage.org/items/show/41589,"Atlas of Washington County, Iowa","United States|Iowa|Washington County|1900-1910||||","(Iowa Publishing Co., 1906, Atlas of Washington County, Iowa)",,,"Iowa Publishing Co.;|State Historical Society of Iowa (Iowa City);",1906|2012-01-06,,"No commercial reproduction or distribution of this file is permitted without permission.","Iowa Counties Historic Atlases;","1 atlas: b&w.; 39 X 48 cm.",English,"Text; Still image;|Plats (Maps); World maps; Tables of contents; Portraits; Photographs; Land surveys; Histories; Directories; Diagrams; Business announcements; Advertisements;|jp2;",168474626|https://digital.lib.uiowa.edu/,,,,,,,,,,,,,,,,,,,,,,,,,,,,,,,,,,,,,,,,,,,,,,,,"<a href=""https://digital.lib.uiowa.edu/"" target=""_blank"">View this item in its source respository</a>",,,,,,,,,,,,,,,,,,,,,,,,,,,,,http://www.iowaheritage.org/files/original/19e1f1b7d66215e75cb708dd2da1a854.jpg,"Remote Item","Iowa Counties Historic Atlases",1,0
41321,http://www.iowaheritage.org/items/show/41321,"Atlas of Washington County, Iowa","United States|Iowa|Washington County|1870-1880|","Harrison and Warner, 1874, Atlas of Washington County, Iowa.",,,"Harrison & Warner;|State Historical Society of Iowa (Iowa City)",1874|2011-06-10,,"No commercial reproduction or distribution of this file is permitted without permission.","Iowa Counties Historic Atlas","1 atlas: b&w.; 36 x 41 cm.",English,"Still image; Text;|Atlases; Maps; Plats (Maps); Statistics; Tables (documents);|jp2;",168474626|https://digital.lib.uiowa.edu/,,,,,,,,,,,,,,,,,,,,,,,,,,,,,,,,,,,,,,,,,,,,,,,,"<a href=""https://digital.lib.uiowa.edu/"" target=""_blank"">View this item in its source respository</a>",,,,,,,,,,,,,,,,,,,,,,,,,,,,,http://www.iowaheritage.org/files/original/206b4ffa7bd87bb9e547b9d6d3e237bb.jpg,"Remote Item","Iowa Counties Historic Atlases",1,0
41078,http://www.iowaheritage.org/items/show/41078,"Atlas of Washington County, Iowa","United States|Iowa|Washington County|1920-1930",,,,"Iowa Map Company|University of Iowa. Libraries. Map Collection",1920,,"No commercial reproduction or distribution of this file is permitted without permission.","Iowa Counties Historic Atlases","1 atlas : 41 p. ; 39 cm.",eng,"Still image; Text|Atlases; Articles; Maps; Directories|jp2",168474626|https://digital.lib.uiowa.edu/,,,,,,,,,,,,,,,,,,,,,,,,,,,,,,,,,,,,,,,,,,,,,,,,"<a href=""https://digital.lib.uiowa.edu/"" target=""_blank"">View this item in its source respository</a>",,,,,,,,,,,,,,,,,,,,,,,,,,,,,http://www.iowaheritage.org/files/original/92dc88d424f242ee9d0f4b7004baf07a.jpg,"Remote Item","Iowa Counties Historic Atlases",1,0
41631,http://www.iowaheritage.org/items/show/41631,"Atlas of Warren County, Iowa","United States|Iowa|Warren County|1900-1910||","(The Indianola Record, 1902-1903, Atlas of Warren County, Iowa)",,,"The Indianola Record|State Historical Society of Iowa (Iowa City)",1902-1903|2012-04-11,,"No commercial reproduction or distribution of this file is permitted without permission.","Iowa Counties Historic Atlases|Atlas of Warren County Iowa (Indianola, IA: The Indianola Record 1902-1903)","1 atlas: b&w.; 11 X 14 cm.",,"Still image; Text;|Historical maps; Maps; Census records; Title pages; Tables of contents; Plats (Maps);|jp2;","Warren 1902-1903|168474626|https://digital.lib.uiowa.edu/",,,,,,,,,,,,,,,,,,,,,,,,,,,,,,,,,,,,,,,,,,,,,,,,"<a href=""https://digital.lib.uiowa.edu/"" target=""_blank"">View this item in its source respository</a>",,,,,,,,,,,,,,,,,,,,,,,,,,,,,http://www.iowaheritage.org/files/original/100e6ffe9d93acc6dc6c16bed3186052.jpg,"Remote Item","Iowa Counties Historic Atlases",1,0
41558,http://www.iowaheritage.org/items/show/41558,"Atlas of Warren County, Iowa","United States|Iowa|Warren County|1900-1910||||","(Hovey & Frame, 1902, Atlas of Warren County, Iowa)",,,"Hovey & Frame|State Historical Society of Iowa (Iowa City);",1902|2011-11-09,,"No commercial reproduction or distribution of this file is permitted without permission.","Iowa Counties Historic Atlases;","1 l.; b&w.: 29 X 36 cm.",English,"Still image; Text;|Plats (Maps); Title pages; Land surveys; Census records;|jp2;",168474626|https://digital.lib.uiowa.edu/,,,,,,,,,,,,,,,,,,,,,,,,,,,,,,,,,,,,,,,,,,,,,,,,"<a href=""https://digital.lib.uiowa.edu/"" target=""_blank"">View this item in its source respository</a>",,,,,,,,,,,,,,,,,,,,,,,,,,,,,http://www.iowaheritage.org/files/original/fa5305323b878c0c8086b80e237e59c1.jpg,"Remote Item","Iowa Counties Historic Atlases",1,0
41490,http://www.iowaheritage.org/items/show/41490,"Atlas of Warren County, Iowa","United States|Iowa|Warren County|1910-1920||||","(Midland Map Co., 1915, Atlas of Warren County, Iowa)",,,"Midland Map Co.;|State Historical Society of Iowa (Iowa City);",1915|2011-07-11,,"No commercial reproduction or distribution of this file is permitted without permission.","Iowa Counties Historic Atlases;","1 atlas: b&w.; 38 X 46 cm.",English,"Text; Still image;|Plats (Maps); Title pages; Indexes;|jp2;",168474626|https://digital.lib.uiowa.edu/,,,,,,,,,,,,,,,,,,,,,,,,,,,,,,,,,,,,,,,,,,,,,,,,"<a href=""https://digital.lib.uiowa.edu/"" target=""_blank"">View this item in its source respository</a>",,,,,,,,,,,,,,,,,,,,,,,,,,,,,http://www.iowaheritage.org/files/original/6960e55b73988195d6b85f98073c6bbb.jpg,"Remote Item","Iowa Counties Historic Atlases",1,0
41145,http://www.iowaheritage.org/items/show/41145,"Atlas of Warren County Iowa","United States|Iowa|Warren County|1870-1880",,,,"Harrison & Warner|State Historical Society of Iowa (Iowa City)",1872,,"No commercial reproduction or distribution of this file is permitted without permission.""","Iowa Counties Historic Atlases",,English,"Still image; Text|Atlases|jp2",168474626|https://digital.lib.uiowa.edu/,,,,,,,,,,,,,,,,,,,,,,,,,,,,,,,,,,,,,,,,,,,,,,,,"<a href=""https://digital.lib.uiowa.edu/"" target=""_blank"">View this item in its source respository</a>",,,,,,,,,,,,,,,,,,,,,,,,,,,,,http://www.iowaheritage.org/files/original/c5ba3351b15b5ee2017f4ea8cb5efe8c.jpg,"Remote Item","Iowa Counties Historic Atlases",1,0
41044,http://www.iowaheritage.org/items/show/41044,"Atlas of the state of Iowa","United States|Iowa|1900-1910",,"Huebinger, Melchoir",,"Iowa Publishing Co.|University of Iowa. Libraries. Map Collection",1904|2005-03-22,,"No commercial reproduction or distribution of this file is permitted without permission.","Iowa Counties Historic Atlases","1 atlas : 99 p. ; 45 cm.",English,"Text; Still image|Atlases; Advertisements; Business announcements; Directories; Indexes (Reference sources); Maps; Photographs|jp2",168474626|https://digital.lib.uiowa.edu/,,,,,,,,,,,,,,,,,,,,,,,,,,,,,,,,,,,,,,,,,,,,,,,,"<a href=""https://digital.lib.uiowa.edu/"" target=""_blank"">View this item in its source respository</a>",,,,,,,,,,,,,,,,,,,,,,,,,,,,,http://www.iowaheritage.org/files/original/163a74e386caf66e00037d2b2ad8a77e.jpg,"Remote Item","Iowa Counties Historic Atlases",1,0
41506,http://www.iowaheritage.org/items/show/41506,"Atlas of Taylor County and the World","United States|Iowa|Taylor County|1920-1930||||","(Anderson Publishing Co., 1923, Atlas of Taylor County and the World)",,,"Anderson Publishing Co.;|University of Iowa. Libraries. Map Collection;",1923|2011-08-01,,"No commercial reproduction or distribution of this file is permitted without permission.","Iowa Counties Historic Atlases;","1 atlas: b&w; 31 X 42 cm.",English,"Text; Still image;|Maps; Plats (Maps); Photographs; Histories; Directories; Census records; Advertisements; Tables of contents; Title pages; World maps;|jp2;",168474626|https://digital.lib.uiowa.edu/,,,,,,,,,,,,,,,,,,,,,,,,,,,,,,,,,,,,,,,,,,,,,,,,"<a href=""https://digital.lib.uiowa.edu/"" target=""_blank"">View this item in its source respository</a>",,,,,,,,,,,,,,,,,,,,,,,,,,,,,http://www.iowaheritage.org/files/original/8e26dfa9c71739b68c65349ff439ce95.jpg,"Remote Item","Iowa Counties Historic Atlases",1,0
