 




﻿"Item Id","Item URI","Dublin Core:Title","Dublin Core:Subject","Dublin Core:Description","Dublin Core:Creator","Dublin Core:Source","Dublin Core:Publisher","Dublin Core:Date","Dublin Core:Contributor","Dublin Core:Rights","Dublin Core:Relation","Dublin Core:Format","Dublin Core:Language","Dublin Core:Type","Dublin Core:Identifier","Dublin Core:Coverage","Item Type Metadata:Text","Item Type Metadata:Interviewer","Item Type Metadata:Interviewee","Item Type Metadata:Location","Item Type Metadata:Transcription","Item Type Metadata:Local URL","Item Type Metadata:Original Format","Item Type Metadata:Physical Dimensions","Item Type Metadata:Duration","Item Type Metadata:Compression","Item Type Metadata:Producer","Item Type Metadata:Director","Item Type Metadata:Bit Rate/Frequency","Item Type Metadata:Time Summary","Item Type Metadata:Email Body","Item Type Metadata:Subject Line","Item Type Metadata:From","Item Type Metadata:To","Item Type Metadata:CC","Item Type Metadata:BCC","Item Type Metadata:Number of Attachments","Item Type Metadata:Standards","Item Type Metadata:Objectives","Item Type Metadata:Materials","Item Type Metadata:Lesson Plan Text","Item Type Metadata:URL","Item Type Metadata:Event Type","Item Type Metadata:Participants","Item Type Metadata:Birth Date","Item Type Metadata:Birthplace","Item Type Metadata:Death Date","Item Type Metadata:Occupation","Item Type Metadata:Biographical Text","Item Type Metadata:Bibliography","Item Type Metadata:Digital Reproduction Information","Item Type Metadata:Repository","Item Type Metadata:Repository Collection","Item Type Metadata:Contact information.","Item Type Metadata:File Name","Item Type Metadata:Notes","Item Type Metadata:Digital item created","Item Type Metadata:Digital item modified","Item Type Metadata:Executive Orders","Item Type Metadata:Record Created","Item Type Metadata:Record Modified","Item Type Metadata:Transcription2","Item Type Metadata:Source URL","Omeka Legacy File:Additional Creator","Omeka Legacy File:Transcriber","Omeka Legacy File:Producer","Omeka Legacy File:Render Device","Omeka Legacy File:Render Details","Omeka Legacy File:Capture Date","Omeka Legacy File:Capture Device","Omeka Legacy File:Capture Details","Omeka Legacy File:Change History","Omeka Legacy File:Watermark","Omeka Legacy File:Encryption","Omeka Legacy File:Compression","Omeka Legacy File:Post Processing","Omeka Image File:Width","Omeka Image File:Height","Omeka Image File:Bit Depth","Omeka Image File:Channels","Omeka Image File:Exif String","Omeka Image File:Exif Array","Omeka Image File:IPTC String","Omeka Image File:IPTC Array","Omeka Video File:Bitrate","Omeka Video File:Duration","Omeka Video File:Sample Rate","Omeka Video File:Codec","Omeka Video File:Width","Omeka Video File:Height",tags,file,itemType,collection,public,featured
19652,https://www.iowaheritage.org/items/show/19652,"Badminton at a picnic, The University of Iowa, 1938","Women|University of Iowa. Dept. of Physical Education for Women|United States -- Iowa -- Iowa City|1930-1940|Students|Universities & colleges|Badminton|Picnics|Men|University of Iowa. Dept. of Health and Sport Studies",,unknown,,"University of Iowa. Libraries. Iowa Women's Archives",1938|2008-06-10,,"Educational use only, no other permissions given. U.S. and international copyright laws may protect this item. Commercial use or distribution of this digital object is not permitted without written permission of the Iowa Women's Archives.","University of Iowa Physical Education for Women|The University of Iowa Department of Physical Education for Women Records, 1900-2006|http://www.lib.uiowa.edu/collguides/?IWA0106|Picnics & Social Activities, 1936-1940",jpeg|13|18,,"Still image|Photographs",IWA0106|uipe0786.jpg|https://digital.lib.uiowa.edu/,,,,,,,,,,,,,,,,,,,,,,,,,,,,,,,,,,,,,,,,,,,,,,,,"<a href=""https://digital.lib.uiowa.edu/"" target=""_blank"">View this item in its source respository</a>",,,,,,,,,,,,,,,,,,,,,,,,,,,,,https://www.iowaheritage.org/files/original/cf80cdd98c7052af9903a23b2867b7ea.jpg,"Remote Item","University of Iowa Physical Education for Women",1,0
19649,https://www.iowaheritage.org/items/show/19649,"Horseshoes at a picnic , The University of Iowa, 1938","Women|University of Iowa. Dept. of Physical Education for Women|United States -- Iowa -- Iowa City|1930-1940|Students|Universities & colleges|Picnics|Men|Horseshoe pitching|University of Iowa. Dept. of Health and Sport Studies",,unknown,,"University of Iowa. Libraries. Iowa Women's Archives",1938|2008-06-10,,"Educational use only, no other permissions given. U.S. and international copyright laws may protect this item. Commercial use or distribution of this digital object is not permitted without written permission of the Iowa Women's Archives.","University of Iowa Physical Education for Women|The University of Iowa Department of Physical Education for Women Records, 1900-2006|http://www.lib.uiowa.edu/collguides/?IWA0106|Picnics & Social Activities, 1936-1940",jpeg|13|18,,"Still image|Photographs",IWA0106|uipe0785.jpg|https://digital.lib.uiowa.edu/,,,,,,,,,,,,,,,,,,,,,,,,,,,,,,,,,,,,,,,,,,,,,,,,"<a href=""https://digital.lib.uiowa.edu/"" target=""_blank"">View this item in its source respository</a>",,,,,,,,,,,,,,,,,,,,,,,,,,,,,https://www.iowaheritage.org/files/original/7da168e3f45fcaa3c7ce48acddcb91e3.jpg,"Remote Item","University of Iowa Physical Education for Women",1,0
19646,https://www.iowaheritage.org/items/show/19646,"Volleyball game at a picnic, The University of Iowa, late 1930s","Women|University of Iowa. Dept. of Physical Education for Women|United States -- Iowa -- Iowa City|1930-1940|Students|Universities & colleges|Volleyball|Men|Picnics|University of Iowa. Dept. of Health and Sport Studies",,unknown,,"University of Iowa. Libraries. Iowa Women's Archives",1930/1939|2008-06-11,,"Educational use only, no other permissions given. U.S. and international copyright laws may protect this item. Commercial use or distribution of this digital object is not permitted without written permission of the Iowa Women's Archives.","University of Iowa Physical Education for Women|The University of Iowa Department of Physical Education for Women Records, 1900-2006|http://www.lib.uiowa.edu/collguides/?IWA0106|Picnics & Social Activities, 1936-1940",jpeg|13|18,,"Still image|Photographs",IWA0106|uipe0799.jpg|https://digital.lib.uiowa.edu/,,,,,,,,,,,,,,,,,,,,,,,,,,,,,,,,,,,,,,,,,,,,,,,,"<a href=""https://digital.lib.uiowa.edu/"" target=""_blank"">View this item in its source respository</a>",,,,,,,,,,,,,,,,,,,,,,,,,,,,,https://www.iowaheritage.org/files/original/1c5d6c28cc823a5ab99a4e0bebf6b5ec.jpg,"Remote Item","University of Iowa Physical Education for Women",1,0
19643,https://www.iowaheritage.org/items/show/19643,"Volleyball games at a picnic, The University of Iowa, 1940s","Women|University of Iowa. Dept. of Physical Education for Women|United States -- Iowa -- Iowa City|1940-1950|Students|Universities & colleges|Volleyball|Men|Picnics|University of Iowa. Dept. of Health and Sport Studies",,unknown,,"University of Iowa. Libraries. Iowa Women's Archives",1940/1949|2008-06-11,,"Educational use only, no other permissions given. U.S. and international copyright laws may protect this item. Commercial use or distribution of this digital object is not permitted without written permission of the Iowa Women's Archives.","University of Iowa Physical Education for Women|The University of Iowa Department of Physical Education for Women Records, 1900-2006|http://www.lib.uiowa.edu/collguides/?IWA0106|Picnics & Social Activities, 1936-1940",jpeg|13|17,,"Still image|Photographs",IWA0106|uipe0798.jpg|https://digital.lib.uiowa.edu/,,,,,,,,,,,,,,,,,,,,,,,,,,,,,,,,,,,,,,,,,,,,,,,,"<a href=""https://digital.lib.uiowa.edu/"" target=""_blank"">View this item in its source respository</a>",,,,,,,,,,,,,,,,,,,,,,,,,,,,,https://www.iowaheritage.org/files/original/7f362a3a19e4cf6f69cbeb91bac213ab.jpg,"Remote Item","University of Iowa Physical Education for Women",1,0
19640,https://www.iowaheritage.org/items/show/19640,"Social picnic, The University of Iowa, 1930s","Women|African Americans|University of Iowa. Dept. of Physical Education for Women|United States -- Iowa -- Iowa City|1930-1940|Students|Universities & colleges|Picnics|University of Iowa. Dept. of Health and Sport Studies",,unknown,,"University of Iowa. Libraries. Iowa Women's Archives",1930/1939|2008-06-11,,"Educational use only, no other permissions given. U.S. and international copyright laws may protect this item. Commercial use or distribution of this digital object is not permitted without written permission of the Iowa Women's Archives.","University of Iowa Physical Education for Women|The University of Iowa Department of Physical Education for Women Records, 1900-2006|http://www.lib.uiowa.edu/collguides/?IWA0106|Picnics & Social Activities, 1936-1940",jpeg|10|15,,"Still image|Photographs",IWA0106|uipe0797.jpg|https://digital.lib.uiowa.edu/,,,,,,,,,,,,,,,,,,,,,,,,,,,,,,,,,,,,,,,,,,,,,,,,"<a href=""https://digital.lib.uiowa.edu/"" target=""_blank"">View this item in its source respository</a>",,,,,,,,,,,,,,,,,,,,,,,,,,,,,https://www.iowaheritage.org/files/original/4a322ac4c931b8c032c2cbf4bca11db6.jpg,"Remote Item","University of Iowa Physical Education for Women",1,0
19636,https://www.iowaheritage.org/items/show/19636,"Social picnic, The University of Iowa, 1930s","Women|African Americans|University of Iowa. Dept. of Physical Education for Women|United States -- Iowa -- Iowa City|1930-1940|Students|Universities & colleges|Picnics|University of Iowa. Dept. of Health and Sport Studies",,unknown,,"University of Iowa. Libraries. Iowa Women's Archives",1930/1939|2008-06-11,,"Educational use only, no other permissions given. U.S. and international copyright laws may protect this item. Commercial use or distribution of this digital object is not permitted without written permission of the Iowa Women's Archives.","University of Iowa Physical Education for Women|The University of Iowa Department of Physical Education for Women Records, 1900-2006|http://www.lib.uiowa.edu/collguides/?IWA0106|Picnics & Social Activities, 1936-1940",jpeg|10|15,,"Still image|Photographs",IWA0106|uipe0796.jpg|https://digital.lib.uiowa.edu/,,,,,,,,,,,,,,,,,,,,,,,,,,,,,,,,,,,,,,,,,,,,,,,,"<a href=""https://digital.lib.uiowa.edu/"" target=""_blank"">View this item in its source respository</a>",,,,,,,,,,,,,,,,,,,,,,,,,,,,,https://www.iowaheritage.org/files/original/ba203ee41e06e9125c68db49b00a4376.jpg,"Remote Item","University of Iowa Physical Education for Women",1,0
19634,https://www.iowaheritage.org/items/show/19634,"Outdoor games at a picnic, The University of Iowa, late 1930s","Women|University of Iowa. Dept. of Physical Education for Women|United States -- Iowa -- Iowa City|1930-1940|Students|Universities & colleges|Men|Picnics|Bicycles & tricycles|University of Iowa. Dept. of Health and Sport Studies",,unknown,,"University of Iowa. Libraries. Iowa Women's Archives",1930/1939|2008-06-11,,"Educational use only, no other permissions given. U.S. and international copyright laws may protect this item. Commercial use or distribution of this digital object is not permitted without written permission of the Iowa Women's Archives.","University of Iowa Physical Education for Women|The University of Iowa Department of Physical Education for Women Records, 1900-2006|http://www.lib.uiowa.edu/collguides/?IWA0106|Picnics & Social Activities, 1936-1940",jpeg|13|18,,"Still image|Photographs",IWA0106|uipe0795.jpg|https://digital.lib.uiowa.edu/,,,,,,,,,,,,,,,,,,,,,,,,,,,,,,,,,,,,,,,,,,,,,,,,"<a href=""https://digital.lib.uiowa.edu/"" target=""_blank"">View this item in its source respository</a>",,,,,,,,,,,,,,,,,,,,,,,,,,,,,https://www.iowaheritage.org/files/original/55b20f1a0270879cb88ca8eadb087f7a.jpg,"Remote Item","University of Iowa Physical Education for Women",1,0
19631,https://www.iowaheritage.org/items/show/19631,"Women's physical education facilities from a report to the President, The University of Iowa, 1944","Women|University of Iowa. Dept. of Physical Education for Women|United States -- Iowa -- Iowa City|1940-1950|Students|Universities & colleges|Classrooms|Stairways|Studying|Arts & crafts|Exercise equipment & supplies|University of Iowa. Dept. of Health and Sport Studies",,unknown,,"University of Iowa. Libraries. Iowa Women's Archives",1944|2008-06-10,,"Educational use only, no other permissions given. U.S. and international copyright laws may protect this item. Commercial use or distribution of this digital object is not permitted without written permission of the Iowa Women's Archives.","University of Iowa Physical Education for Women|The University of Iowa Department of Physical Education for Women Records, 1900-2006|http://www.lib.uiowa.edu/collguides/?IWA0106|Halsey Hall",jpeg|28|43,,"Still image|Photographs; Brochures",IWA0106|uipe0777.jpg|https://digital.lib.uiowa.edu/,,,,,,,,,,,,,,,,,,,,,,,,,,,,,,,,,,,,,,,,,,,,,,,,"<a href=""https://digital.lib.uiowa.edu/"" target=""_blank"">View this item in its source respository</a>",,,,,,,,,,,,,,,,,,,,,,,,,,,,,https://www.iowaheritage.org/files/original/ce2cdc9dc19f621a2f70975c8b236ddd.jpg,"Remote Item","University of Iowa Physical Education for Women",1,0
19628,https://www.iowaheritage.org/items/show/19628,"Women's recreation facilities, The University of Iowa, 1900-1957","Women|University of Iowa. Dept. of Physical Education for Women|United States -- Iowa -- Iowa City|Students|Universities & colleges|Buildings|University of Iowa. Dept. of Health and Sport Studies|Close Hall (Iowa City, Iowa)|Schaeffer Hall (Iowa City, Iowa)|Halsey Hall (Iowa City, Iowa)","Depicts Close Hall, Hall of Liberal Arts, Women's Gymnasium and the Annex.",unknown,,"University of Iowa. Libraries. Iowa Women's Archives",1900/1957|2008-06-10,,"Educational use only, no other permissions given. U.S. and international copyright laws may protect this item. Commercial use or distribution of this digital object is not permitted without written permission of the Iowa Women's Archives.","University of Iowa Physical Education for Women|The University of Iowa Department of Physical Education for Women Records, 1900-2006|http://www.lib.uiowa.edu/collguides/?IWA0106|Halsey Hall",jpeg|28|43,,"Still image|Photographs; Scrapbooks",IWA0106|uipe0775.jpg|https://digital.lib.uiowa.edu/,,,,,,,,,,,,,,,,,,,,,,,,,,,,,,,,,,,,,,,,,,,,,,,,"<a href=""https://digital.lib.uiowa.edu/"" target=""_blank"">View this item in its source respository</a>",,,,,,,,,,,,,,,,,,,,,,,,,,,,,https://www.iowaheritage.org/files/original/5af6dcbbd3fb3bda7ca6c6eb1b32c12d.jpg,"Remote Item","University of Iowa Physical Education for Women",1,0
19625,https://www.iowaheritage.org/items/show/19625,"Women's physical education activities, The University of Iowa, 1940s","Women|University of Iowa. Dept. of Physical Education for Women|United States -- Iowa -- Iowa City|1940-1950|Students|Universities & colleges|Volleyball|Archery|Bows (Archery)|Softball|Track athletics|Canoeists (Sports)|Canoes|Golf|Golfers|Field hockey|Field hockey players|Rugby|Hurdle racing|University of Iowa. Dept. of Health and Sport Studies",,unknown,,"University of Iowa. Libraries. Iowa Women's Archives",1940/1949|2008-06-10,,"Educational use only, no other permissions given. U.S. and international copyright laws may protect this item. Commercial use or distribution of this digital object is not permitted without written permission of the Iowa Women's Archives.","University of Iowa Physical Education for Women|The University of Iowa Department of Physical Education for Women Records, 1900-2006|http://www.lib.uiowa.edu/collguides/?IWA0106|Halsey Hall",jpeg|28|43,,"Still image|Photographs; Scrapbooks",IWA0106|uipe0773.jpg|https://digital.lib.uiowa.edu/,,,,,,,,,,,,,,,,,,,,,,,,,,,,,,,,,,,,,,,,,,,,,,,,"<a href=""https://digital.lib.uiowa.edu/"" target=""_blank"">View this item in its source respository</a>",,,,,,,,,,,,,,,,,,,,,,,,,,,,,https://www.iowaheritage.org/files/original/790bc44a4498313b34af2de1ccb5ddf1.jpg,"Remote Item","University of Iowa Physical Education for Women",1,0
