 




﻿"Item Id","Item URI","Dublin Core:Title","Dublin Core:Subject","Dublin Core:Description","Dublin Core:Creator","Dublin Core:Source","Dublin Core:Publisher","Dublin Core:Date","Dublin Core:Contributor","Dublin Core:Rights","Dublin Core:Relation","Dublin Core:Format","Dublin Core:Language","Dublin Core:Type","Dublin Core:Identifier","Dublin Core:Coverage","Item Type Metadata:Text","Item Type Metadata:Interviewer","Item Type Metadata:Interviewee","Item Type Metadata:Location","Item Type Metadata:Transcription","Item Type Metadata:Local URL","Item Type Metadata:Original Format","Item Type Metadata:Physical Dimensions","Item Type Metadata:Duration","Item Type Metadata:Compression","Item Type Metadata:Producer","Item Type Metadata:Director","Item Type Metadata:Bit Rate/Frequency","Item Type Metadata:Time Summary","Item Type Metadata:Email Body","Item Type Metadata:Subject Line","Item Type Metadata:From","Item Type Metadata:To","Item Type Metadata:CC","Item Type Metadata:BCC","Item Type Metadata:Number of Attachments","Item Type Metadata:Standards","Item Type Metadata:Objectives","Item Type Metadata:Materials","Item Type Metadata:Lesson Plan Text","Item Type Metadata:URL","Item Type Metadata:Event Type","Item Type Metadata:Participants","Item Type Metadata:Birth Date","Item Type Metadata:Birthplace","Item Type Metadata:Death Date","Item Type Metadata:Occupation","Item Type Metadata:Biographical Text","Item Type Metadata:Bibliography","Item Type Metadata:Digital Reproduction Information","Item Type Metadata:Repository","Item Type Metadata:Repository Collection","Item Type Metadata:Contact information.","Item Type Metadata:File Name","Item Type Metadata:Notes","Item Type Metadata:Digital item created","Item Type Metadata:Digital item modified","Item Type Metadata:Executive Orders","Item Type Metadata:Record Created","Item Type Metadata:Record Modified","Item Type Metadata:Transcription2","Item Type Metadata:Source URL","Omeka Legacy File:Additional Creator","Omeka Legacy File:Transcriber","Omeka Legacy File:Producer","Omeka Legacy File:Render Device","Omeka Legacy File:Render Details","Omeka Legacy File:Capture Date","Omeka Legacy File:Capture Device","Omeka Legacy File:Capture Details","Omeka Legacy File:Change History","Omeka Legacy File:Watermark","Omeka Legacy File:Encryption","Omeka Legacy File:Compression","Omeka Legacy File:Post Processing","Omeka Image File:Width","Omeka Image File:Height","Omeka Image File:Bit Depth","Omeka Image File:Channels","Omeka Image File:Exif String","Omeka Image File:Exif Array","Omeka Image File:IPTC String","Omeka Image File:IPTC Array","Omeka Video File:Bitrate","Omeka Video File:Duration","Omeka Video File:Sample Rate","Omeka Video File:Codec","Omeka Video File:Width","Omeka Video File:Height",tags,file,itemType,collection,public,featured
68982,https://www.iowaheritage.org/items/show/68982,"Library staff, 1960","Iowa State University|University Library|Staff","Library staff are gathered in front of the east entrance to the library for a group photograph. Row 1 (left to right) Mrs. Severa Vandergaast, Mrs. Sidney Chang, Karen Huisman, Cheryll Rankin, Gayle Thorson, Sonia Leistad, Sharon Snelling, Mrs. Mary Lou Wiebe, Mildred Danielson, Mrs. Helen Lentner. Row 2 - Miss Grace Oberheim, Miss Frances Warner, Miss Margaret Orr, Mrs. Judy Madsen, Miss Janette Buck, Mrs. Caroline Gill, Mrs. Sue Hanson, Mrs. Eugenia Harris, Mrs. Mildred McCone, Sharon Stolte. Row 3 - Mrs. Donna Hellinga, Mrs. Phyllis Murrell, Mrs. Roxanne Murray, Mrs. Tonie Whitman, Mrs. Sandra Gay, Mrs. Karee Henshaw. Row 4 - Mrs. Jeanette Gilchrist, Mrs. Karen Heald, Mrs. Wanda Borchers, John Galejs, John McNee, Miss Elizabeth Windsor, Mrs. Dorothy Kehlenbeck, Mrs. Helen Zickefoose, Grant Hanson. Row 5 - Robert W. Orr, Miss Evelyn Wimersberger, Mrs. Matyne Easton, Mrs. Eva Robbins, Miss E. Marjorie Smith|The library was first housed in Old Main, which also contained the college's reception room, lecture hall, specimen museum, students' rooms, a chapel, kitchen, laundry, and dining room. An initial purchase of $2,500 for books for the library was made in 1870 by President Welch. The library was moved to Morrill Hall in 1896 and to the Central Building (now Beardshear Hall) in 1913. In 1925, the new library building was completed to house the library's 115,000 volumes under one roof. The new facility was not large enough to allow for adequate expansion and was outgrown within five years. The first addition to the library was completed in 1961, with a second addition completed in 1969 and a third addition was completed in 1983. In 1984, the Iowa State University Library was officially dedicated as the W. Robert and Ellen Sorge Parks Library.","Iowa State University",RS-25-1-D.Library.2043-04-01,"Iowa State University Library Special Collections: http://www.add.lib.iastate.edu/spcl/index.html",1960-09-09|2008-04,,"U.S. and international copyright laws protect this digital image. Commercial use or distribution of the image is not permitted without prior permission of the copyright holder. For permission to use the digital image, please contact Iowa State University Library, Special Collections archives@iastate.edu  For reproductions see:  http://www.add.lib.iastate.edu/spcl/services/photfees.html","University Photographs; http://www.add.lib.iastate.edu/spcl/collections/images.html","Photograph| 11.5 x 16.5 cm",,Image|Image,RS-25-1-D.Library.2043-04-01|https://digitalcollections.lib.iastate.edu/,,,,,,,,,,,,,,,,,,,,,,,,,,,,,,,,,,,,,,,,,,,,,,,,"<a href=""https://digitalcollections.lib.iastate.edu/"" target=""_blank"">View this item in its source respository</a>",,,,,,,,,,,,,,,,,,,,,,,,,,,,,https://www.iowaheritage.org/files/original/99b86f4d379e52df42a529166d44c687.jpg,"Remote Item","Iowa State University Library Photograph Collection",1,0
73476,https://www.iowaheritage.org/items/show/73476,"Library staff, 1960","Iowa State University|University Library|Staff","Library staff are gathered in front of the east entrance to the library for a group photograph. Row 1 (left to right) Mrs. Severa Vandergaast, Mrs. Sidney Chang, Karen Huisman, Cheryll Rankin, Gayle Thorson, Sonia Leistad, Sharon Snelling, Mrs. Mary Lou Wiebe, Mildred Danielson, Mrs. Helen Lentner. Row 2 - Miss Grace Oberheim, Miss Frances Warner, Miss Margaret Orr, Mrs. Judy Madsen, Miss Janette Buck, Mrs. Caroline Gill, Mrs. Sue Hanson, Mrs. Eugenia Harris, Mrs. Mildred McCone, Sharon Stolte. Row 3 - Mrs. Donna Hellinga, Mrs. Phyllis Murrell, Mrs. Roxanne Murray, Mrs. Tonie Whitman, Mrs. Sandra Gay, Mrs. Karee Henshaw. Row 4 - Mrs. Jeanette Gilchrist, Mrs. Karen Heald, Mrs. Wanda Borchers, John Galejs, John McNee, Miss Elizabeth Windsor, Mrs. Dorothy Kehlenbeck, Mrs. Helen Zickefoose, Grant Hanson. Row 5 - Robert W. Orr, Miss Evelyn Wimersberger, Mrs. Matyne Easton, Mrs. Eva Robbins, Miss E. Marjorie Smith|The library was first housed in Old Main, which also contained the college's reception room, lecture hall, specimen museum, students' rooms, a chapel, kitchen, laundry, and dining room. An initial purchase of $2,500 for books for the library was made in 1870 by President Welch. The library was moved to Morrill Hall in 1896 and to the Central Building (now Beardshear Hall) in 1913. In 1925, the new library building was completed to house the library's 115,000 volumes under one roof. The new facility was not large enough to allow for adequate expansion and was outgrown within five years. The first addition to the library was completed in 1961, with a second addition completed in 1969 and a third addition was completed in 1983. In 1984, the Iowa State University Library was officially dedicated as the W. Robert and Ellen Sorge Parks Library.","Iowa State University",RS-25-1-D.Library.2043-04-01,"Iowa State University Library Special Collections: http://www.add.lib.iastate.edu/spcl/index.html",1960-09-09|2008-04,,"U.S. and international copyright laws protect this digital image. Commercial use or distribution of the image is not permitted without prior permission of the copyright holder. For permission to use the digital image, please contact Iowa State University Library, Special Collections archives@iastate.edu  For reproductions see:  http://www.add.lib.iastate.edu/spcl/services/photfees.html","University Photographs; http://www.add.lib.iastate.edu/spcl/collections/images.html","Photograph| 11.5 x 16.5 cm",,Image|Image,RS-25-1-D.Library.2043-04-01|https://digitalcollections.lib.iastate.edu/,,,,,,,,,,,,,,,,,,,,,,,,,,,,,,,,,,,,,,,,,,,,,,,,"<a href=""https://digitalcollections.lib.iastate.edu/"" target=""_blank"">View this item in its source respository</a>",,,,,,,,,,,,,,,,,,,,,,,,,,,,,https://www.iowaheritage.org/files/original/388054c95d5662ff437f2d8a40ac923d.jpg,"Remote Item",,1,0
69032,https://www.iowaheritage.org/items/show/69032,"Library staff, 1994","Iowa State University|University Library","Library staff members (left to right): Dennis Wendall, Judy Hoffman, Tyler Walters, Renee Tesdall and Ed Goedeken are standing in front of a library display entitled, """"A 125 year partnership in research and learning.""""|The library was first housed in Old Main, which also contained the college's reception room, lecture hall, specimen museum, students' rooms, a chapel, kitchen, laundry, and dining room. An initial purchase of $2,500 for books for the library was made in 1870 by President Welch. The library was moved to Morrill Hall in 1896 and to the Central Building (now Beardshear Hall) in 1913. In 1925, the new library building was completed to house the library's 115,000 volumes under one roof. The new facility was not large enough to allow for adequate expansion and was outgrown within five years. The first addition to the library was completed in 1961, with a second addition completed in 1969 and a third addition was completed in 1983. In 1984, the Iowa State University Library was officially dedicated as the W. Robert and Ellen Sorge Parks Library.","Iowa State University",RS-25-3-E.Library.2050-01-01,"Iowa State University Library Special Collections: http://www.add.lib.iastate.edu/spcl/index.html",1994|2012-08,,"U.S. and international copyright laws protect this digital image. Commercial use or distribution of the image is not permitted without prior permission of the copyright holder. For permission to use the digital image, please contact Iowa State University Library, Special Collections archives@iastate.edu  For reproductions see:  http://www.add.lib.iastate.edu/spcl/services/photfees.html","University Photographs; http://www.add.lib.iastate.edu/spcl/collections/images.html","Photograph| 12.6 x 8.8cm",,Image|Image,RS-25-3-E.Library.2050-01-01|https://digitalcollections.lib.iastate.edu/,,,,,,,,,,,,,,,,,,,,,,,,,,,,,,,,,,,,,,,,,,,,,,,,"<a href=""https://digitalcollections.lib.iastate.edu/"" target=""_blank"">View this item in its source respository</a>",,,,,,,,,,,,,,,,,,,,,,,,,,,,,https://www.iowaheritage.org/files/original/4968695fdc5136bcb9a17d4b1358f330.jpg,"Remote Item","Iowa State University Library Photograph Collection",1,0
73526,https://www.iowaheritage.org/items/show/73526,"Library staff, 1994","Iowa State University|University Library","Library staff members (left to right): Dennis Wendall, Judy Hoffman, Tyler Walters, Renee Tesdall and Ed Goedeken are standing in front of a library display entitled, """"A 125 year partnership in research and learning.""""|The library was first housed in Old Main, which also contained the college's reception room, lecture hall, specimen museum, students' rooms, a chapel, kitchen, laundry, and dining room. An initial purchase of $2,500 for books for the library was made in 1870 by President Welch. The library was moved to Morrill Hall in 1896 and to the Central Building (now Beardshear Hall) in 1913. In 1925, the new library building was completed to house the library's 115,000 volumes under one roof. The new facility was not large enough to allow for adequate expansion and was outgrown within five years. The first addition to the library was completed in 1961, with a second addition completed in 1969 and a third addition was completed in 1983. In 1984, the Iowa State University Library was officially dedicated as the W. Robert and Ellen Sorge Parks Library.","Iowa State University",RS-25-3-E.Library.2050-01-01,"Iowa State University Library Special Collections: http://www.add.lib.iastate.edu/spcl/index.html",1994|2012-08,,"U.S. and international copyright laws protect this digital image. Commercial use or distribution of the image is not permitted without prior permission of the copyright holder. For permission to use the digital image, please contact Iowa State University Library, Special Collections archives@iastate.edu  For reproductions see:  http://www.add.lib.iastate.edu/spcl/services/photfees.html","University Photographs; http://www.add.lib.iastate.edu/spcl/collections/images.html","Photograph| 12.6 x 8.8cm",,Image|Image,RS-25-3-E.Library.2050-01-01|https://digitalcollections.lib.iastate.edu/,,,,,,,,,,,,,,,,,,,,,,,,,,,,,,,,,,,,,,,,,,,,,,,,"<a href=""https://digitalcollections.lib.iastate.edu/"" target=""_blank"">View this item in its source respository</a>",,,,,,,,,,,,,,,,,,,,,,,,,,,,,https://www.iowaheritage.org/files/original/7c65aebf3fa459e1100f80e30cdee22f.jpg,"Remote Item",,1,0
68895,https://www.iowaheritage.org/items/show/68895,"Library study tables and desks in the 1st Addition, 1966","Iowa State University|University Library|Desks|1st Addition","Library study tables and desks sit on orange carpet next to blue columns in the 1st Addition.|The library was first housed in Old Main, which also contained the college's reception room, lecture hall, specimen museum, students' rooms, a chapel, kitchen, laundry, and dining room. An initial purchase of $2,500 for books for the library was made in 1870 by President Welch. The library was moved to Morrill Hall in 1896 and to the Central Building (now Beardshear Hall) in 1913. In 1925, the new library building was completed to house the library's 115,000 volumes under one roof. The new facility was not large enough to allow for adequate expansion and was outgrown within five years. The first addition to the library was completed in 1961, with a second addition completed in 1969 and a third addition was completed in 1983. In 1984, the Iowa State University Library was officially dedicated as the W. Robert and Ellen Sorge Parks Library.","Iowa State University",RS-4-8-H.Library.147-05-03,"Iowa State University Library Special Collections: http://www.add.lib.iastate.edu/spcl/index.html",1966|2012-08,,"U.S. and international copyright laws protect this digital image. Commercial use or distribution of the image is not permitted without prior permission of the copyright holder. For permission to use the digital image, please contact Iowa State University Library, Special Collections archives@iastate.edu  For reproductions see:  http://www.add.lib.iastate.edu/spcl/services/photfees.html","University Photographs; http://www.add.lib.iastate.edu/spcl/collections/images.html",Photograph,,Image|Image,RS-4-8-H.Library.147-05-03|https://digitalcollections.lib.iastate.edu/,,,,,,,,,,,,,,,,,,,,,,,,,,,,,,,,,,,,,,,,,,,,,,,,"<a href=""https://digitalcollections.lib.iastate.edu/"" target=""_blank"">View this item in its source respository</a>",,,,,,,,,,,,,,,,,,,,,,,,,,,,,https://www.iowaheritage.org/files/original/4dc2844f95ca03de0afbb45f03030cba.jpg,"Remote Item","Iowa State University Library Photograph Collection",1,0
73389,https://www.iowaheritage.org/items/show/73389,"Library study tables and desks in the 1st Addition, 1966","Iowa State University|University Library|Desks|1st Addition","Library study tables and desks sit on orange carpet next to blue columns in the 1st Addition.|The library was first housed in Old Main, which also contained the college's reception room, lecture hall, specimen museum, students' rooms, a chapel, kitchen, laundry, and dining room. An initial purchase of $2,500 for books for the library was made in 1870 by President Welch. The library was moved to Morrill Hall in 1896 and to the Central Building (now Beardshear Hall) in 1913. In 1925, the new library building was completed to house the library's 115,000 volumes under one roof. The new facility was not large enough to allow for adequate expansion and was outgrown within five years. The first addition to the library was completed in 1961, with a second addition completed in 1969 and a third addition was completed in 1983. In 1984, the Iowa State University Library was officially dedicated as the W. Robert and Ellen Sorge Parks Library.","Iowa State University",RS-4-8-H.Library.147-05-03,"Iowa State University Library Special Collections: http://www.add.lib.iastate.edu/spcl/index.html",1966|2012-08,,"U.S. and international copyright laws protect this digital image. Commercial use or distribution of the image is not permitted without prior permission of the copyright holder. For permission to use the digital image, please contact Iowa State University Library, Special Collections archives@iastate.edu  For reproductions see:  http://www.add.lib.iastate.edu/spcl/services/photfees.html","University Photographs; http://www.add.lib.iastate.edu/spcl/collections/images.html",Photograph,,Image|Image,RS-4-8-H.Library.147-05-03|https://digitalcollections.lib.iastate.edu/,,,,,,,,,,,,,,,,,,,,,,,,,,,,,,,,,,,,,,,,,,,,,,,,"<a href=""https://digitalcollections.lib.iastate.edu/"" target=""_blank"">View this item in its source respository</a>",,,,,,,,,,,,,,,,,,,,,,,,,,,,,https://www.iowaheritage.org/files/original/6e8d9a2c993a6dd73966f42d7fc1c8f2.jpg,"Remote Item",,1,0
69043,https://www.iowaheritage.org/items/show/69043,"Library technical services staff, 1980","Iowa State University|University Library|staff","The library technical services staff pose in this formal portrait taken in 1980.|The library was first housed in Old Main, which also contained the college's reception room, lecture hall, specimen museum, students' rooms, a chapel, kitchen, laundry, and dining room. An initial purchase of $2,500 for books for the library was made in 1870 by President Welch. The library was moved to Morrill Hall in 1896 and to the Central Building (now Beardshear Hall) in 1913. In 1925, the new library building was completed to house the library's 115,000 volumes under one roof. The new facility was not large enough to allow for adequate expansion and was outgrown within five years. The first addition to the library was completed in 1961, with a second addition completed in 1969 and a third addition was completed in 1983. In 1984, the Iowa State University Library was officially dedicated as the W. Robert and Ellen Sorge Parks Library.","Iowa State University",RS-25-5-D.Library.2054-01-01,"Iowa State University Library Special Collections: http://www.add.lib.iastate.edu/spcl/index.html",1980|2012-08,,"U.S. and international copyright laws protect this digital image. Commercial use or distribution of the image is not permitted without prior permission of the copyright holder. For permission to use the digital image, please contact Iowa State University Library, Special Collections archives@iastate.edu  For reproductions see:  http://www.add.lib.iastate.edu/spcl/services/photfees.html","University Photographs; http://www.add.lib.iastate.edu/spcl/collections/images.html","Photograph| 16.6 x 11.6cm",,Image|Image,RS-25-5-D.Library.2054-01-01|https://digitalcollections.lib.iastate.edu/,,,,,,,,,,,,,,,,,,,,,,,,,,,,,,,,,,,,,,,,,,,,,,,,"<a href=""https://digitalcollections.lib.iastate.edu/"" target=""_blank"">View this item in its source respository</a>",,,,,,,,,,,,,,,,,,,,,,,,,,,,,https://www.iowaheritage.org/files/original/b98f87e1b32adf8c8f3e652ef6febe88.jpg,"Remote Item","Iowa State University Library Photograph Collection",1,0
73537,https://www.iowaheritage.org/items/show/73537,"Library technical services staff, 1980","Iowa State University|University Library|staff","The library technical services staff pose in this formal portrait taken in 1980.|The library was first housed in Old Main, which also contained the college's reception room, lecture hall, specimen museum, students' rooms, a chapel, kitchen, laundry, and dining room. An initial purchase of $2,500 for books for the library was made in 1870 by President Welch. The library was moved to Morrill Hall in 1896 and to the Central Building (now Beardshear Hall) in 1913. In 1925, the new library building was completed to house the library's 115,000 volumes under one roof. The new facility was not large enough to allow for adequate expansion and was outgrown within five years. The first addition to the library was completed in 1961, with a second addition completed in 1969 and a third addition was completed in 1983. In 1984, the Iowa State University Library was officially dedicated as the W. Robert and Ellen Sorge Parks Library.","Iowa State University",RS-25-5-D.Library.2054-01-01,"Iowa State University Library Special Collections: http://www.add.lib.iastate.edu/spcl/index.html",1980|2012-08,,"U.S. and international copyright laws protect this digital image. Commercial use or distribution of the image is not permitted without prior permission of the copyright holder. For permission to use the digital image, please contact Iowa State University Library, Special Collections archives@iastate.edu  For reproductions see:  http://www.add.lib.iastate.edu/spcl/services/photfees.html","University Photographs; http://www.add.lib.iastate.edu/spcl/collections/images.html","Photograph| 16.6 x 11.6cm",,Image|Image,RS-25-5-D.Library.2054-01-01|https://digitalcollections.lib.iastate.edu/,,,,,,,,,,,,,,,,,,,,,,,,,,,,,,,,,,,,,,,,,,,,,,,,"<a href=""https://digitalcollections.lib.iastate.edu/"" target=""_blank"">View this item in its source respository</a>",,,,,,,,,,,,,,,,,,,,,,,,,,,,,https://www.iowaheritage.org/files/original/93041ce62468294281e0a917c7bc73ab.jpg,"Remote Item",,1,0