 




﻿"Item Id","Item URI","Dublin Core:Title","Dublin Core:Subject","Dublin Core:Description","Dublin Core:Creator","Dublin Core:Source","Dublin Core:Publisher","Dublin Core:Date","Dublin Core:Contributor","Dublin Core:Rights","Dublin Core:Relation","Dublin Core:Format","Dublin Core:Language","Dublin Core:Type","Dublin Core:Identifier","Dublin Core:Coverage","Item Type Metadata:Text","Item Type Metadata:Interviewer","Item Type Metadata:Interviewee","Item Type Metadata:Location","Item Type Metadata:Transcription","Item Type Metadata:Local URL","Item Type Metadata:Original Format","Item Type Metadata:Physical Dimensions","Item Type Metadata:Duration","Item Type Metadata:Compression","Item Type Metadata:Producer","Item Type Metadata:Director","Item Type Metadata:Bit Rate/Frequency","Item Type Metadata:Time Summary","Item Type Metadata:Email Body","Item Type Metadata:Subject Line","Item Type Metadata:From","Item Type Metadata:To","Item Type Metadata:CC","Item Type Metadata:BCC","Item Type Metadata:Number of Attachments","Item Type Metadata:Standards","Item Type Metadata:Objectives","Item Type Metadata:Materials","Item Type Metadata:Lesson Plan Text","Item Type Metadata:URL","Item Type Metadata:Event Type","Item Type Metadata:Participants","Item Type Metadata:Birth Date","Item Type Metadata:Birthplace","Item Type Metadata:Death Date","Item Type Metadata:Occupation","Item Type Metadata:Biographical Text","Item Type Metadata:Bibliography","Item Type Metadata:Digital Reproduction Information","Item Type Metadata:Repository","Item Type Metadata:Repository Collection","Item Type Metadata:Contact information.","Item Type Metadata:File Name","Item Type Metadata:Notes","Item Type Metadata:Digital item created","Item Type Metadata:Digital item modified","Item Type Metadata:Executive Orders","Item Type Metadata:Record Created","Item Type Metadata:Record Modified","Item Type Metadata:Transcription2","Item Type Metadata:Source URL","Omeka Legacy File:Additional Creator","Omeka Legacy File:Transcriber","Omeka Legacy File:Producer","Omeka Legacy File:Render Device","Omeka Legacy File:Render Details","Omeka Legacy File:Capture Date","Omeka Legacy File:Capture Device","Omeka Legacy File:Capture Details","Omeka Legacy File:Change History","Omeka Legacy File:Watermark","Omeka Legacy File:Encryption","Omeka Legacy File:Compression","Omeka Legacy File:Post Processing","Omeka Image File:Width","Omeka Image File:Height","Omeka Image File:Bit Depth","Omeka Image File:Channels","Omeka Image File:Exif String","Omeka Image File:Exif Array","Omeka Image File:IPTC String","Omeka Image File:IPTC Array","Omeka Video File:Bitrate","Omeka Video File:Duration","Omeka Video File:Sample Rate","Omeka Video File:Codec","Omeka Video File:Width","Omeka Video File:Height",tags,file,itemType,collection,public,featured
11139,https://www.iowaheritage.org/items/show/11139,"Trip to Lewisburg by Iowa Infantry, 29th Regiment. July 26, 1864","Soldiers|United States -- History -- Civil War, 1861-1865|Kellogg, J. P.|United States. Army. Iowa Infantry Regiment, 29th (1862-1865)|United States -- West Virginia -- Lewisburg|1860-1870|War|Military life|Marching",,"Kellogg, J. P.",,"University of Iowa. Libraries. Special Collections Dept.",1864-07-26,,"Educational use only, no other permissions given. U.S. and international copyright laws may protect this digital image. Commercial use or distribution of the image is not permitted without prior permission of the copyright holder.","Civil War Diaries and Letters|Civil War Collection|http://www.lib.uiowa.edu/spec-coll/msc/ToMsC950/MsC906/CivilWarCollection.html",,,Text|Reminiscences|jpeg,MsC906|index.cpd|https://digital.lib.uiowa.edu/,,,,,,,,,,,,,,,,,,,,,,,,,,,,,,,,,,,,,,,,,,,,,,,,"<a href=""https://digital.lib.uiowa.edu/"" target=""_blank"">View this item in its source respository</a>",,,,,,,,,,,,,,,,,,,,,,,,,,,,,https://www.iowaheritage.org/files/original/42a76ed36283a20f66c1409be04e1ae2.jpg,"Remote Item","African American Women in Iowa Collection",1,0
15801,https://www.iowaheritage.org/items/show/15801,"Trip to Lewisburg by Iowa Infantry, 29th Regiment. July 26, 1864","Soldiers|United States -- History -- Civil War, 1861-1865|Kellogg, J. P.|United States. Army. Iowa Infantry Regiment, 29th (1862-1865)|United States -- West Virginia -- Lewisburg|1860-1870|War|Military life|Marching",,"Kellogg, J. P.",,"University of Iowa. Libraries. Special Collections Dept.",1864-07-26,,"Educational use only, no other permissions given. U.S. and international copyright laws may protect this digital image. Commercial use or distribution of the image is not permitted without prior permission of the copyright holder.","Civil War Diaries and Letters|Civil War Collection|http://www.lib.uiowa.edu/spec-coll/msc/ToMsC950/MsC906/CivilWarCollection.html",,,Text|Reminiscences|jpeg,MsC906|index.cpd|https://digital.lib.uiowa.edu/,,,,,,,,,,,,,,,,,,,,,,,,,,,,,,,,,,,,,,,,,,,,,,,,"<a href=""https://digital.lib.uiowa.edu/"" target=""_blank"">View this item in its source respository</a>",,,,,,,,,,,,,,,,,,,,,,,,,,,,,https://www.iowaheritage.org/files/original/1d82e44e27a29f82384ba053425c0268.jpg,"Remote Item","Civil War Diaries and Letters",1,0
11140,https://www.iowaheritage.org/items/show/11140,"Some recollections of my father's family, 1926","Soldiers|United States -- History -- Civil War, 1861-1865|Kimberly, Wesley Clark|United States. Army. Iowa Cavalry Regiment, 1st (1861-1866)|United States|1920-1930|War|Frontier & pioneer life|Kimberly, William|Kimberly, Phebe","Includes information on 1st Iowa Cavalry, 1861-1866.","Kimberly, Wesley Clark",,"University of Iowa. Libraries. Special Collections Dept.",1926,,"Educational use only, no other permissions given. U.S. and international copyright laws may protect this digital image. Commercial use or distribution of the image is not permitted without prior permission of the copyright holder.","Civil War Diaries and Letters|Civil War Collection|http://www.lib.uiowa.edu/spec-coll/msc/ToMsC950/MsC906/CivilWarCollection.html",,,"Text; Still image|Memoirs; Typescript|jpeg",MsC906|index.cpd|https://digital.lib.uiowa.edu/,,,,,,,,,,,,,,,,,,,,,,,,,,,,,,,,,,,,,,,,,,,,,,,,"<a href=""https://digital.lib.uiowa.edu/"" target=""_blank"">View this item in its source respository</a>",,,,,,,,,,,,,,,,,,,,,,,,,,,,,https://www.iowaheritage.org/files/original/ef6cd32d82cfa7b78d05d451d4ed4712.jpg,"Remote Item","African American Women in Iowa Collection",1,0
15804,https://www.iowaheritage.org/items/show/15804,"Some recollections of my father's family, 1926","Soldiers|United States -- History -- Civil War, 1861-1865|Kimberly, Wesley Clark|United States. Army. Iowa Cavalry Regiment, 1st (1861-1866)|United States|1920-1930|War|Frontier & pioneer life|Kimberly, William|Kimberly, Phebe","Includes information on 1st Iowa Cavalry, 1861-1866.","Kimberly, Wesley Clark",,"University of Iowa. Libraries. Special Collections Dept.",1926,,"Educational use only, no other permissions given. U.S. and international copyright laws may protect this digital image. Commercial use or distribution of the image is not permitted without prior permission of the copyright holder.","Civil War Diaries and Letters|Civil War Collection|http://www.lib.uiowa.edu/spec-coll/msc/ToMsC950/MsC906/CivilWarCollection.html",,,"Text; Still image|Memoirs; Typescript|jpeg",MsC906|index.cpd|https://digital.lib.uiowa.edu/,,,,,,,,,,,,,,,,,,,,,,,,,,,,,,,,,,,,,,,,,,,,,,,,"<a href=""https://digital.lib.uiowa.edu/"" target=""_blank"">View this item in its source respository</a>",,,,,,,,,,,,,,,,,,,,,,,,,,,,,https://www.iowaheritage.org/files/original/423a3ac6a5bf1d9fc39f29e8d8fe744c.jpg,"Remote Item","Civil War Diaries and Letters",1,0
11168,https://www.iowaheritage.org/items/show/11168,"Joseph Kohout letters, 1863-1865","Soldiers|United States -- History -- Civil War, 1861-1865|Kohout, Joseph, 1843-1876|United States. Army. Iowa Infantry Regiment, 31st (1862-1865). Company H|United States|1860-1870|War|Campaigns & battles|Military life|Vicksburg (Miss.) -- History -- Siege, 1863|Atlanta campaign, 1864|United States -- Mississippi -- Vicksburg|United States -- Georgia -- Atlanta","Letters written during the Civil War which include references to the siege of Vicksburg and the Atlanta campaign.","Kohout, Joseph, 1843-1876",,"University of Iowa. Libraries. Special Collections Dept.",1863/1865,,"Educational use only, no other permissions given. U.S. and international copyright laws may protect this digital image. Commercial use or distribution of the image is not permitted without prior permission of the copyright holder.","Civil War Diaries and Letters|Civil War, 1861-1865|http://infohawk.uiowa.edu/F/?func=find-b&find_code=SYS&local_base=UIOWA&request=001782161",,,Text|Correspondence|jpeg,"MsL K795|index.cpd|https://digital.lib.uiowa.edu/",,,,,,,,,,,,,,,,,,,,,,,,,,,,,,,,,,,,,,,,,,,,,,,,"<a href=""https://digital.lib.uiowa.edu/"" target=""_blank"">View this item in its source respository</a>",,,,,,,,,,,,,,,,,,,,,,,,,,,,,https://www.iowaheritage.org/files/original/c2ec2a5cc459f9b569e6f8de7244e610.jpg,"Remote Item","African American Women in Iowa Collection",1,0
15893,https://www.iowaheritage.org/items/show/15893,"Joseph Kohout letters, 1863-1865","Soldiers|United States -- History -- Civil War, 1861-1865|Kohout, Joseph, 1843-1876|United States. Army. Iowa Infantry Regiment, 31st (1862-1865). Company H|United States|1860-1870|War|Campaigns & battles|Military life|Vicksburg (Miss.) -- History -- Siege, 1863|Atlanta campaign, 1864|United States -- Mississippi -- Vicksburg|United States -- Georgia -- Atlanta","Letters written during the Civil War which include references to the siege of Vicksburg and the Atlanta campaign.","Kohout, Joseph, 1843-1876",,"University of Iowa. Libraries. Special Collections Dept.",1863/1865,,"Educational use only, no other permissions given. U.S. and international copyright laws may protect this digital image. Commercial use or distribution of the image is not permitted without prior permission of the copyright holder.","Civil War Diaries and Letters|Civil War, 1861-1865|http://infohawk.uiowa.edu/F/?func=find-b&find_code=SYS&local_base=UIOWA&request=001782161",,,Text|Correspondence|jpeg,"MsL K795|index.cpd|https://digital.lib.uiowa.edu/",,,,,,,,,,,,,,,,,,,,,,,,,,,,,,,,,,,,,,,,,,,,,,,,"<a href=""https://digital.lib.uiowa.edu/"" target=""_blank"">View this item in its source respository</a>",,,,,,,,,,,,,,,,,,,,,,,,,,,,,https://www.iowaheritage.org/files/original/b5cbb17376b443728f700ec9c670fc70.jpg,"Remote Item","Civil War Diaries and Letters",1,0
11149,https://www.iowaheritage.org/items/show/11149,"Ann Larimer letters to husband John, February - July 1865","War|United States -- History -- Civil War, 1861-1865|Larimer, Ann|United States -- Iowa -- Queen City|1860-1870|Frontier & pioneer life|Families|Larimer, John","Contains details about life in rural Iowa and news about family and friends as well as words of encouragement for husband John.","Larimer, Ann",,"University of Iowa. Libraries. Iowa Women's Archives",1865-02/1865-07,,"Educational use only, no other permissions given. U.S. and international copyright laws may protect this item. Commercial use or distribution of this digital object is not permitted without written permission of the Iowa Women's Archives.","Civil War Diaries and Letters|Ann Larimer letters|http://lib.uiowa.edu/collguides/?IWA0107",,,Text|Correspondence|jpeg,index.cpd|https://digital.lib.uiowa.edu/,,,,,,,,,,,,,,,,,,,,,,,,,,,,,,,,,,,,,,,,,,,,,,,,"<a href=""https://digital.lib.uiowa.edu/"" target=""_blank"">View this item in its source respository</a>",,,,,,,,,,,,,,,,,,,,,,,,,,,,,https://www.iowaheritage.org/files/original/682200b9a15605899aa7dd534fb43fec.jpg,"Remote Item","African American Women in Iowa Collection",1,0
15832,https://www.iowaheritage.org/items/show/15832,"Ann Larimer letters to husband John, February - July 1865","War|United States -- History -- Civil War, 1861-1865|Larimer, Ann|United States -- Iowa -- Queen City|1860-1870|Frontier & pioneer life|Families|Larimer, John","Contains details about life in rural Iowa and news about family and friends as well as words of encouragement for husband John.","Larimer, Ann",,"University of Iowa. Libraries. Iowa Women's Archives",1865-02/1865-07,,"Educational use only, no other permissions given. U.S. and international copyright laws may protect this item. Commercial use or distribution of this digital object is not permitted without written permission of the Iowa Women's Archives.","Civil War Diaries and Letters|Ann Larimer letters|http://lib.uiowa.edu/collguides/?IWA0107",,,Text|Correspondence|jpeg,index.cpd|https://digital.lib.uiowa.edu/,,,,,,,,,,,,,,,,,,,,,,,,,,,,,,,,,,,,,,,,,,,,,,,,"<a href=""https://digital.lib.uiowa.edu/"" target=""_blank"">View this item in its source respository</a>",,,,,,,,,,,,,,,,,,,,,,,,,,,,,https://www.iowaheritage.org/files/original/92e72f66208f93b7719108d926b4c0d4.jpg,"Remote Item","Civil War Diaries and Letters",1,0
11005,https://www.iowaheritage.org/items/show/11005,"Frank Malcolm letters, 1864","Soldiers|United States -- History -- Civil War, 1861-1865|Malcolm, Frank|United States. Army. Iowa Infantry Regiment, 7th (1861-1865). Company D|United States -- Iowa -- Fort Madison|1860-1870|Campaigns & battles|Military camps|Military officers|War casualties|Battlefields|Quartermasters|Sherman's March to the Sea|Malcolm, Eliza|Sherman, William T. (William Tecumseh), 1820-1891|Johnston, Joseph E. (Joseph Eggleston), 1807-1891|Hood, John Bell, 1831-1879|United States -- Tennessee -- Prospect|United States -- Georgia -- Roswell|United States -- Georgia -- Marietta|United States -- Georgia -- Atlanta|United States -- Georgia -- Savannah|United States -- South Carolina -- Columbia|United States -- Washington, D.C.",,"Malcolm, Frank",,"University of Iowa. Libraries. Special Collections Dept.",1864|2008-10-15,,"Educational use only, no other permissions given. U.S. and international copyright laws may protect this digital image. Commercial use or distribution of the image is not permitted without prior permission of the copyright holder.","Civil War Diaries and Letters; Abraham Lincoln Collection|Frank Malcolm Letters|http://lib.uiowa.edu/collguides/?MSC0026",,,Text|Correspondence|jpeg,MSC0026|31858055128122|https://digital.lib.uiowa.edu/,,,,,,,,,,,,,,,,,,,,,,,,,,,,,,,,,,,,,,,,,,,,,,,,"<a href=""https://digital.lib.uiowa.edu/"" target=""_blank"">View this item in its source respository</a>",,,,,,,,,,,,,,,,,,,,,,,,,,,,,https://www.iowaheritage.org/files/original/4ff045d128d0eaf2a25ae71468736950.jpg,"Remote Item","African American Women in Iowa Collection",1,0
11006,https://www.iowaheritage.org/items/show/11006,"Frank Malcolm letters, 1865","Soldiers|United States -- History -- Civil War, 1861-1865|Malcolm, Frank|United States. Army. Iowa Infantry Regiment, 7th (1861-1865). Company D|United States -- Iowa -- Fort Madison|1860-1870|Campaigns & battles|Military camps|Military officers|War casualties|Battlefields|Quartermasters|Poison ivy|Sherman's March to the Sea|Malcolm, Eliza|Sherman, William T. (William Tecumseh), 1820-1891|Johnston, Joseph E. (Joseph Eggleston), 1807-1891|Hood, John Bell, 1831-1879|Stanton, Edwin McMasters, 1814-1869|United States -- Georgia -- Roswell|United States -- Georgia -- Marietta|United States -- Georgia -- Atlanta|United States -- Georgia -- Savannah|United States -- South Carolina -- Columbia|United States -- Washington, D.C.",,"Malcolm, Frank",,"University of Iowa. Libraries. Special Collections Dept.",1865|2008-10-15,,"Educational use only, no other permissions given. U.S. and international copyright laws may protect this digital image. Commercial use or distribution of the image is not permitted without prior permission of the copyright holder.","Civil War Diaries and Letters; Abraham Lincoln Collection|Frank Malcolm Letters|http://lib.uiowa.edu/collguides/?MSC0026",,,Text|Correspondence|jpeg,MSC0026|31858055128130|https://digital.lib.uiowa.edu/,,,,,,,,,,,,,,,,,,,,,,,,,,,,,,,,,,,,,,,,,,,,,,,,"<a href=""https://digital.lib.uiowa.edu/"" target=""_blank"">View this item in its source respository</a>",,,,,,,,,,,,,,,,,,,,,,,,,,,,,https://www.iowaheritage.org/files/original/241beac27a62eead1b1fb63fa17b5e3a.jpg,"Remote Item","African American Women in Iowa Collection",1,0
