 




﻿"Item Id","Item URI","Dublin Core:Title","Dublin Core:Subject","Dublin Core:Description","Dublin Core:Creator","Dublin Core:Source","Dublin Core:Publisher","Dublin Core:Date","Dublin Core:Contributor","Dublin Core:Rights","Dublin Core:Relation","Dublin Core:Format","Dublin Core:Language","Dublin Core:Type","Dublin Core:Identifier","Dublin Core:Coverage","Item Type Metadata:Text","Item Type Metadata:Interviewer","Item Type Metadata:Interviewee","Item Type Metadata:Location","Item Type Metadata:Transcription","Item Type Metadata:Local URL","Item Type Metadata:Original Format","Item Type Metadata:Physical Dimensions","Item Type Metadata:Duration","Item Type Metadata:Compression","Item Type Metadata:Producer","Item Type Metadata:Director","Item Type Metadata:Bit Rate/Frequency","Item Type Metadata:Time Summary","Item Type Metadata:Email Body","Item Type Metadata:Subject Line","Item Type Metadata:From","Item Type Metadata:To","Item Type Metadata:CC","Item Type Metadata:BCC","Item Type Metadata:Number of Attachments","Item Type Metadata:Standards","Item Type Metadata:Objectives","Item Type Metadata:Materials","Item Type Metadata:Lesson Plan Text","Item Type Metadata:URL","Item Type Metadata:Event Type","Item Type Metadata:Participants","Item Type Metadata:Birth Date","Item Type Metadata:Birthplace","Item Type Metadata:Death Date","Item Type Metadata:Occupation","Item Type Metadata:Biographical Text","Item Type Metadata:Bibliography","Item Type Metadata:Digital Reproduction Information","Item Type Metadata:Repository","Item Type Metadata:Repository Collection","Item Type Metadata:Contact information.","Item Type Metadata:File Name","Item Type Metadata:Notes","Item Type Metadata:Digital item created","Item Type Metadata:Digital item modified","Item Type Metadata:Executive Orders","Item Type Metadata:Record Created","Item Type Metadata:Record Modified","Item Type Metadata:Transcription2","Item Type Metadata:Source URL","Omeka Legacy File:Additional Creator","Omeka Legacy File:Transcriber","Omeka Legacy File:Producer","Omeka Legacy File:Render Device","Omeka Legacy File:Render Details","Omeka Legacy File:Capture Date","Omeka Legacy File:Capture Device","Omeka Legacy File:Capture Details","Omeka Legacy File:Change History","Omeka Legacy File:Watermark","Omeka Legacy File:Encryption","Omeka Legacy File:Compression","Omeka Legacy File:Post Processing","Omeka Image File:Width","Omeka Image File:Height","Omeka Image File:Bit Depth","Omeka Image File:Channels","Omeka Image File:Exif String","Omeka Image File:Exif Array","Omeka Image File:IPTC String","Omeka Image File:IPTC Array","Omeka Video File:Bitrate","Omeka Video File:Duration","Omeka Video File:Sample Rate","Omeka Video File:Codec","Omeka Video File:Width","Omeka Video File:Height",tags,file,itemType,collection,public,featured
19828,https://www.iowaheritage.org/items/show/19828,"High School boys help load Friendship Train|Tribune (Ames, Iowa)|Friendship train","Reconstruction (1939-1951) –- Iowa|United States -- Iowa -- Story County -- Ames|World War II|Friendship food train|Food relief, American –- Europe","Image of high school boys packing milk into cartons accompanies article.",,,"State Historical Society of Iowa, Iowa City","1947-11-13|1941, 1942, 1943, 1944, 1945, 1946, 1947, 1948, 1949, 1950|2006-02-14",,"This digital image may be used for educational purposes, as long as it is not altered in any way. No commercial reproduction or distribution of this file is permitted without written permission of the State Historical Society of Iowa.","World War II Iowa Press Clippings","image/jpeg; Display image: 726,687 bytes|1 clipping : b&w ; 14 x 15 cm.",eng,"Still image; Text; Clippings",1947-11-13-16.jpg|173848404|https://digital.lib.uiowa.edu/,,,,,,,,,,,,,,,,,,,,,,,,,,,,,,,,,,,,,,,,,,,,,,,,"<a href=""https://digital.lib.uiowa.edu/"" target=""_blank"">View this item in its source respository</a>",,,,,,,,,,,,,,,,,,,,,,,,,,,,,https://www.iowaheritage.org/files/original/c43fb9811b1f4a5684fc97541a40e010.jpg,"Remote Item","World War II Iowa Press Clippings",1,0
19789,https://www.iowaheritage.org/items/show/19789,"In the wake of the news|Union (Belle Plaine, Iowa)|Friendship train","Reconstruction (1939-1951) –- Iowa|United States -- Iowa|World War II|Friendship food train|Food relief, American –- Europe",,,,"State Historical Society of Iowa, Iowa City","1947-11-13|1941, 1942, 1943, 1944, 1945, 1946, 1947, 1948, 1949, 1950|2006-02-14",,"This digital image may be used for educational purposes, as long as it is not altered in any way. No commercial reproduction or distribution of this file is permitted without written permission of the State Historical Society of Iowa.","World War II Iowa Press Clippings","image/jpeg; Display image: 299,086 bytes|1 clipping : b&w ; 14 x 5 cm.",eng,"Text; Clippings",1947-11-13-08.jpg|173848404|https://digital.lib.uiowa.edu/,,,,,,,,,,,,,,,,,,,,,,,,,,,,,,,,,,,,,,,,,,,,,,,,"<a href=""https://digital.lib.uiowa.edu/"" target=""_blank"">View this item in its source respository</a>",,,,,,,,,,,,,,,,,,,,,,,,,,,,,https://www.iowaheritage.org/files/original/c744edd30e4aaf28c703e7f9daab52b3.jpg,"Remote Item","World War II Iowa Press Clippings",1,0
19683,https://www.iowaheritage.org/items/show/19683,"Iowa Citians slate boxcar to aid relief|Merchants back idea for food shipment on friendship train|Iowan (Iowa City, Iowa)|Friendship train","Reconstruction (1939-1951) –- Iowa|United States -- Iowa -- Johnson County -- Iowa City|World War II|Friendship food train|Food relief, American –- Europe",,,,"State Historical Society of Iowa, Iowa City","1947-10-31|1941, 1942, 1943, 1944, 1945, 1946, 1947, 1948, 1949, 1950|2006-02-15",,"This digital image may be used for educational purposes, as long as it is not altered in any way. No commercial reproduction or distribution of this file is permitted without written permission of the State Historical Society of Iowa.","World War II Iowa Press Clippings","image/jpeg; Display image: 408,963 bytes|1 clipping : b&w ;  18 x 11 cm.",eng,"Text; Clippings",1947-10-31.jpg|173848404|https://digital.lib.uiowa.edu/,,,,,,,,,,,,,,,,,,,,,,,,,,,,,,,,,,,,,,,,,,,,,,,,"<a href=""https://digital.lib.uiowa.edu/"" target=""_blank"">View this item in its source respository</a>",,,,,,,,,,,,,,,,,,,,,,,,,,,,,https://www.iowaheritage.org/files/original/46388f44b5c3a0a6e23ad1b649996149.jpg,"Remote Item","World War II Iowa Press Clippings",1,0
19698,https://www.iowaheritage.org/items/show/19698,"Iowa gifts amaze Friendship train sponsors|7,000 at Boone for ceremony|Morning Register (Des Moines, Iowa)|Friendship train","Reconstruction (1939-1951) –- Iowa|World War II|Friendship food train|Food relief, American –- Europe",,,,"State Historical Society of Iowa, Iowa City","1947-11-14|1941, 1942, 1943, 1944, 1945, 1946, 1947, 1948, 1949, 1950|2006-02-16",,"This digital image may be used for educational purposes, as long as it is not altered in any way. No commercial reproduction or distribution of this file is permitted without written permission of the State Historical Society of Iowa.","World War II Iowa Press Clippings","image/jpeg;|1 clipping : 3 p.",eng,"Still Image; Text; Clippings",173848404|https://digital.lib.uiowa.edu/,,,,,,,,,,,,,,,,,,,,,,,,,,,,,,,,,,,,,,,,,,,,,,,,"<a href=""https://digital.lib.uiowa.edu/"" target=""_blank"">View this item in its source respository</a>",,,,,,,,,,,,,,,,,,,,,,,,,,,,,https://www.iowaheritage.org/files/original/b113cdbe1656b932718c63b171d06ca3.jpg,"Remote Item","World War II Iowa Press Clippings",1,0
19632,https://www.iowaheritage.org/items/show/19632,"Iowa gives 23 carloads of products|Friendship train rolls on east after stop in Cedar Rapids|Gazette (Cedar Rapids, Iowa)|Friendship train","Reconstruction (1939-1951) –- Iowa|United States -- Iowa -- Linn County -- Cedar Rapids|World War II|Friendship food train|Food relief, American –- Europe",,,,"State Historical Society of Iowa, Iowa City","1947-11-14|1941, 1942, 1943, 1944, 1945, 1946, 1947, 1948, 1949, 1950|2006-02-09",,"This digital image may be used for educational purposes, as long as it is not altered in any way. No commercial reproduction or distribution of this file is permitted without written permission of the State Historical Society of Iowa.","World War II Iowa Press Clippings","image/jpeg; Display image: 658,047 bytes|1 clipping : b&w ; 66 x 5 cm.",eng,"Text; Clippings",1947-11-14-6.jpg|173848404|https://digital.lib.uiowa.edu/,,,,,,,,,,,,,,,,,,,,,,,,,,,,,,,,,,,,,,,,,,,,,,,,"<a href=""https://digital.lib.uiowa.edu/"" target=""_blank"">View this item in its source respository</a>",,,,,,,,,,,,,,,,,,,,,,,,,,,,,https://www.iowaheritage.org/files/original/ff1f2e123c0520eb72070eec72850b83.jpg,"Remote Item","World War II Iowa Press Clippings",1,0
19796,https://www.iowaheritage.org/items/show/19796,"Iowa to give 18 cars for Food Train|Morning Register (Des Moines, Iowa)|Friendship train","Reconstruction (1939-1951) –- Iowa|United States -- Iowa|World War II|Friendship food train|Food relief, American –- Europe",,,,"State Historical Society of Iowa, Iowa City","1947-11-13|1941, 1942, 1943, 1944, 1945, 1946, 1947, 1948, 1949, 1950|2006-02-14",,"This digital image may be used for educational purposes, as long as it is not altered in any way. No commercial reproduction or distribution of this file is permitted without written permission of the State Historical Society of Iowa.","World War II Iowa Press Clippings","image/jpeg; Display image: 313,841 bytes|1 clipping : b&w ; 22 x 10 cm.",eng,"Text; Clippings",1947-11-13-06.jpg|173848404|https://digital.lib.uiowa.edu/,,,,,,,,,,,,,,,,,,,,,,,,,,,,,,,,,,,,,,,,,,,,,,,,"<a href=""https://digital.lib.uiowa.edu/"" target=""_blank"">View this item in its source respository</a>",,,,,,,,,,,,,,,,,,,,,,,,,,,,,https://www.iowaheritage.org/files/original/df7337787355b3c8b02441ffb3e6448d.jpg,"Remote Item","World War II Iowa Press Clippings",1,0
29550,https://www.iowaheritage.org/items/show/29550,"Iowa to load Lincoln food trains today|Morning Register (Des Moines, Iowa)|Friendship train","Food relief|Friendship Food Train|Friendship food train|United States -- Iowa|World War II",,,,"State Historical Society of Iowa, Iowa City",1948-02-12|2009-10-20,,"The digital image may be used for educational purposes, as long as it is not altered in any way.  No commercial reproduction or distribution of this file is permitted without written permission of the State Historical Society of Iowa.","World War II Iowa Press Clippings","image/jpeg|1 clipping : b&w ; 19 x 10 cm|1 clipping : b&w ; 19 x 10 cm",eng,"Text; Clippings; Still Image",https://digital.lib.uiowa.edu/,,,,,,,,,,,,,,,,,,,,,,,,,,,,,,,,,,,,,,,,,,,,,,,,"<a href=""https://digital.lib.uiowa.edu/"" target=""_blank"">View this item in its source respository</a>",,,,,,,,,,,,,,,,,,,,,,,,,,,,,https://www.iowaheritage.org/files/original/9080de064da0c3e983822cae88a2657e.jpg,"Remote Item","World War II Iowa Press Clippings",1,0
19760,https://www.iowaheritage.org/items/show/19760,"Iowa's relief cargo grows|Evening Tribune (Des Moines, Iowa)|Friendship train","Reconstruction (1939-1951) –- Iowa|United States -- Iowa|World War II|Friendship food train|Food relief, American –- Europe",,,,"State Historical Society of Iowa, Iowa City","1947-11-12|1941, 1942, 1943, 1944, 1945, 1946, 1947, 1948, 1949, 1950|2006-02-14",,"This digital image may be used for educational purposes, as long as it is not altered in any way. No commercial reproduction or distribution of this file is permitted without written permission of the State Historical Society of Iowa.","World War II Iowa Press Clippings","image/jpeg; Display image: 395,010 bytes|1 clipping : b&w ; 23 x 5 cm.",eng,"Text; Clippings",1947-11-12-10.jpg|173848404|https://digital.lib.uiowa.edu/,,,,,,,,,,,,,,,,,,,,,,,,,,,,,,,,,,,,,,,,,,,,,,,,"<a href=""https://digital.lib.uiowa.edu/"" target=""_blank"">View this item in its source respository</a>",,,,,,,,,,,,,,,,,,,,,,,,,,,,,https://www.iowaheritage.org/files/original/44131294abcbfaea668f49001c78d537.jpg,"Remote Item","World War II Iowa Press Clippings",1,0
20225,https://www.iowaheritage.org/items/show/20225,"Iowan add 22 carloads|""Friendshipt train rolls on to Europe""|Sun (Sheldon, Iowa)|Friendship train","Reconstruction (1939-1951) –- Iowa|United States -- Iowa|World War II|Friendship food train|Food relief, American –- Europe",,,,"State Historical Society of Iowa, Iowa City","1947-11-24|1941, 1942, 1943, 1944, 1945, 1946, 1947, 1948, 1949, 1950|2006-03-06",,"This digital image may be used for educational purposes, as long as it is not altered in any way. No commercial reproduction or distribution of this file is permitted without written permission of the State Historical Society of Iowa.","World War II Iowa Press Clippings","image/jpeg; Display image: 341,134 bytes|1 clipping : b&w ; 20 x 6 cm.",eng,"Text; Clippings",1947-11-24.JPG|173848404|https://digital.lib.uiowa.edu/,,,,,,,,,,,,,,,,,,,,,,,,,,,,,,,,,,,,,,,,,,,,,,,,"<a href=""https://digital.lib.uiowa.edu/"" target=""_blank"">View this item in its source respository</a>",,,,,,,,,,,,,,,,,,,,,,,,,,,,,https://www.iowaheritage.org/files/original/b22fadde9a714f76b08be003bb6c87b8.jpg,"Remote Item","World War II Iowa Press Clippings",1,0
19778,https://www.iowaheritage.org/items/show/19778,"Iowans greet Food Train|Evening Tribune (Des Moines, Iowa)|Friendship train","Reconstruction (1939-1951) –- Iowa|United States -- Iowa -- Pottawattamie County -- Council Bluffs|World War II|Friendship food train|Food relief, American –- Europe","Image of crowd in front of train accompanies article.",,,"State Historical Society of Iowa, Iowa City","1947-11-13|1941, 1942, 1943, 1944, 1945, 1946, 1947, 1948, 1949, 1950|2006-02-14",,"This digital image may be used for educational purposes, as long as it is not altered in any way. No commercial reproduction or distribution of this file is permitted without written permission of the State Historical Society of Iowa.","World War II Iowa Press Clippings","image/jpeg; Display image: 662,933 bytes|1 clipping : b&w ; 17 x 19 cm.",eng,"Still image; Text; Clippings",1947-11-13-01.jpg|173848404|https://digital.lib.uiowa.edu/,,,,,,,,,,,,,,,,,,,,,,,,,,,,,,,,,,,,,,,,,,,,,,,,"<a href=""https://digital.lib.uiowa.edu/"" target=""_blank"">View this item in its source respository</a>",,,,,,,,,,,,,,,,,,,,,,,,,,,,,https://www.iowaheritage.org/files/original/513c9ddade8ef2723794a41e35c7dc2c.jpg,"Remote Item","World War II Iowa Press Clippings",1,0
