 




﻿"Item Id","Item URI","Dublin Core:Title","Dublin Core:Subject","Dublin Core:Description","Dublin Core:Creator","Dublin Core:Source","Dublin Core:Publisher","Dublin Core:Date","Dublin Core:Contributor","Dublin Core:Rights","Dublin Core:Relation","Dublin Core:Format","Dublin Core:Language","Dublin Core:Type","Dublin Core:Identifier","Dublin Core:Coverage","Item Type Metadata:Text","Item Type Metadata:Interviewer","Item Type Metadata:Interviewee","Item Type Metadata:Location","Item Type Metadata:Transcription","Item Type Metadata:Local URL","Item Type Metadata:Original Format","Item Type Metadata:Physical Dimensions","Item Type Metadata:Duration","Item Type Metadata:Compression","Item Type Metadata:Producer","Item Type Metadata:Director","Item Type Metadata:Bit Rate/Frequency","Item Type Metadata:Time Summary","Item Type Metadata:Email Body","Item Type Metadata:Subject Line","Item Type Metadata:From","Item Type Metadata:To","Item Type Metadata:CC","Item Type Metadata:BCC","Item Type Metadata:Number of Attachments","Item Type Metadata:Standards","Item Type Metadata:Objectives","Item Type Metadata:Materials","Item Type Metadata:Lesson Plan Text","Item Type Metadata:URL","Item Type Metadata:Event Type","Item Type Metadata:Participants","Item Type Metadata:Birth Date","Item Type Metadata:Birthplace","Item Type Metadata:Death Date","Item Type Metadata:Occupation","Item Type Metadata:Biographical Text","Item Type Metadata:Bibliography","Item Type Metadata:Digital Reproduction Information","Item Type Metadata:Repository","Item Type Metadata:Repository Collection","Item Type Metadata:Contact information.","Item Type Metadata:File Name","Item Type Metadata:Notes","Item Type Metadata:Digital item created","Item Type Metadata:Digital item modified","Item Type Metadata:Executive Orders","Item Type Metadata:Record Created","Item Type Metadata:Record Modified","Item Type Metadata:Transcription2","Item Type Metadata:Source URL","Omeka Legacy File:Additional Creator","Omeka Legacy File:Transcriber","Omeka Legacy File:Producer","Omeka Legacy File:Render Device","Omeka Legacy File:Render Details","Omeka Legacy File:Capture Date","Omeka Legacy File:Capture Device","Omeka Legacy File:Capture Details","Omeka Legacy File:Change History","Omeka Legacy File:Watermark","Omeka Legacy File:Encryption","Omeka Legacy File:Compression","Omeka Legacy File:Post Processing","Omeka Image File:Width","Omeka Image File:Height","Omeka Image File:Bit Depth","Omeka Image File:Channels","Omeka Image File:Exif String","Omeka Image File:Exif Array","Omeka Image File:IPTC String","Omeka Image File:IPTC Array","Omeka Video File:Bitrate","Omeka Video File:Duration","Omeka Video File:Sample Rate","Omeka Video File:Codec","Omeka Video File:Width","Omeka Video File:Height",tags,file,itemType,collection,public,featured
21612,https://www.iowaheritage.org/items/show/21612,"Officers at Camp Macbride, The University of Iowa, 1914","Military officers|University of Iowa. Dept. of Military Science|United States -- Iowa -- Iowa City|1910-1920",,"Kent, Frederick W. (Frederick Wallace), 1894-1984",,"The University of Iowa. Libraries. University Archives",1914|2008-03-12,,"Educational use only, no other permissions given. U.S. and international copyright laws may protect this digital object. Commercial use or distribution of the object is not permitted without prior permission of the copyright holder.","Iowa City Town and Campus Scenes|Frederick W. Kent collection of photographs, 1866-2000|http://www.lib.uiowa.edu/collguides/?RG30.0001.01|Prints|Colleges and departments|Military|Military|Scanned with Ricoh Aficio 3228C at 600 ppi, full color. Master images saved in tiff format.",8|13,,"Still image|Photographs|jpeg",RG30.0001.01|mil217.jpg|https://digital.lib.uiowa.edu/,,,,,,,,,,,,,,,,,,,,,,,,,,,,,,,,,,,,,,,,,,,,,,,,"<a href=""https://digital.lib.uiowa.edu/"" target=""_blank"">View this item in its source respository</a>",,,,,,,,,,,,,,,,,,,,,,,,,,,,,https://www.iowaheritage.org/files/original/f6360b658f4c46e7809a265c7b71968d.jpg,"Remote Item","Iowa City Town and Campus Scenes",1,0
21439,https://www.iowaheritage.org/items/show/21439,"Officers of Iowa's first unit standing on Iowa Field, The University of Iowa, between 1910 and 1920","Military officers|University of Iowa. Dept. of Military Science|United States -- Iowa -- Iowa City|1910-1920",,"Kent, Frederick W. (Frederick Wallace), 1894-1984",,"The University of Iowa. Libraries. University Archives",1910/1920|2008-02-04,,"Educational use only, no other permissions given. U.S. and international copyright laws may protect this digital object. Commercial use or distribution of the object is not permitted without prior permission of the copyright holder.","Iowa City Town and Campus Scenes|Frederick W. Kent collection of photographs, 1866-2000|http://www.lib.uiowa.edu/collguides/?RG30.0001.01|Prints|Colleges and departments|Military|Military|Scanned with Ricoh Aficio 3228C at 600 ppi, full color. Master images saved in tiff format.",18|13,,"Still image|Photographs|jpeg",RG30.0001.01|mil128.jpg|https://digital.lib.uiowa.edu/,,,,,,,,,,,,,,,,,,,,,,,,,,,,,,,,,,,,,,,,,,,,,,,,"<a href=""https://digital.lib.uiowa.edu/"" target=""_blank"">View this item in its source respository</a>",,,,,,,,,,,,,,,,,,,,,,,,,,,,,https://www.iowaheritage.org/files/original/72847c1d8ca5b68b4a94109b6acc3224.jpg,"Remote Item","Iowa City Town and Campus Scenes",1,0
23556,https://www.iowaheritage.org/items/show/23556,"Officers standing in the shade near Armory, The University of Iowa, 1950s","Universities & colleges|University of Iowa|United States -- Iowa -- Iowa City|1950-1960|Military parades & ceremonies|Military officers|United States. Army. Reserve Officers' Training Corps|Armory (Iowa City, Iowa)",,"Kent, Frederick W. (Frederick Wallace), 1894-1984",,"University of Iowa. Libraries. University Archives",1950/1959,,"Educational use only, no other permissions given. U.S. and international copyright laws may protect this digital object. Commercial use or distribution of the object is not permitted without prior permission of the copyright holder.","Iowa City Town and Campus Scenes|Frederick W. Kent Collection of Photographs, 1866-2000|http://www.lib.uiowa.edu/collguides/?RG30.0001.01|Prints|Colleges and departments|Military|Military|Scanned with Ricoh Aficio 3228C @ 300 ppi, full color. Master images saved in tiff format.",6|6,,"Still image|Photographs|jpeg",RG30.0001.01|ea0609.jpg|https://digital.lib.uiowa.edu/,,,,,,,,,,,,,,,,,,,,,,,,,,,,,,,,,,,,,,,,,,,,,,,,"<a href=""https://digital.lib.uiowa.edu/"" target=""_blank"">View this item in its source respository</a>",,,,,,,,,,,,,,,,,,,,,,,,,,,,,https://www.iowaheritage.org/files/original/8825dfa625604233e4967a5c882b2635.jpg,"Remote Item","Iowa City Town and Campus Scenes",1,0
23504,https://www.iowaheritage.org/items/show/23504,"Officers talking on a field near University Hospitals, The University of Iowa, 1950s","Universities & colleges|University of Iowa|United States -- Iowa -- Iowa City|1950-1960|Military parades & ceremonies|Military officers|United States. Army. Reserve Officers' Training Corps|University of Iowa. Hospitals and Clinics",,"Kent, Frederick W. (Frederick Wallace), 1894-1984",,"University of Iowa. Libraries. University Archives",1950/1959,,"Educational use only, no other permissions given. U.S. and international copyright laws may protect this digital object. Commercial use or distribution of the object is not permitted without prior permission of the copyright holder.","Iowa City Town and Campus Scenes|Frederick W. Kent Collection of Photographs, 1866-2000|http://www.lib.uiowa.edu/collguides/?RG30.0001.01|Prints|Colleges and departments|Military|Military|Scanned with Ricoh Aficio 3228C @ 300 ppi, full color. Master images saved in tiff format.",6|6,,"Still image|Photographs|jpeg",RG30.0001.01|ea0589.jpg|https://digital.lib.uiowa.edu/,,,,,,,,,,,,,,,,,,,,,,,,,,,,,,,,,,,,,,,,,,,,,,,,"<a href=""https://digital.lib.uiowa.edu/"" target=""_blank"">View this item in its source respository</a>",,,,,,,,,,,,,,,,,,,,,,,,,,,,,https://www.iowaheritage.org/files/original/65a9aed743672e08e9af464dedb66e78.jpg,"Remote Item","Iowa City Town and Campus Scenes",1,0
23500,https://www.iowaheritage.org/items/show/23500,"Officers walking behind the crowd on a field, The University of Iowa, 1950s","Universities & colleges|University of Iowa|United States -- Iowa -- Iowa City|1950-1960|Military parades & ceremonies|Military officers|United States. Army. Reserve Officers' Training Corps",,"Kent, Frederick W. (Frederick Wallace), 1894-1984",,"University of Iowa. Libraries. University Archives",1950/1959,,"Educational use only, no other permissions given. U.S. and international copyright laws may protect this digital object. Commercial use or distribution of the object is not permitted without prior permission of the copyright holder.","Iowa City Town and Campus Scenes|Frederick W. Kent Collection of Photographs, 1866-2000|http://www.lib.uiowa.edu/collguides/?RG30.0001.01|Prints|Colleges and departments|Military|Military|Scanned with Ricoh Aficio 3228C @ 300 ppi, full color. Master images saved in tiff format.",6|6,,"Still image|Photographs|jpeg",RG30.0001.01|ea0586.jpg|https://digital.lib.uiowa.edu/,,,,,,,,,,,,,,,,,,,,,,,,,,,,,,,,,,,,,,,,,,,,,,,,"<a href=""https://digital.lib.uiowa.edu/"" target=""_blank"">View this item in its source respository</a>",,,,,,,,,,,,,,,,,,,,,,,,,,,,,https://www.iowaheritage.org/files/original/97a0b60df4dd299eef02de55726c2436.jpg,"Remote Item","Iowa City Town and Campus Scenes",1,0
21248,https://www.iowaheritage.org/items/show/21248,"Officers, The University of Iowa, 1918","Military officers|University of Iowa. Dept. of Military Science|United States -- Iowa -- Iowa City|1910-1920",,"Kent, Frederick W. (Frederick Wallace), 1894-1984",,"The University of Iowa. Libraries. University Archives",1918|2008-01-31,,"Educational use only, no other permissions given. U.S. and international copyright laws may protect this digital object. Commercial use or distribution of the object is not permitted without prior permission of the copyright holder.","Iowa City Town and Campus Scenes|Frederick W. Kent collection of photographs, 1866-2000|http://www.lib.uiowa.edu/collguides/?RG30.0001.01|Prints|Colleges and departments|Military|Military|Scanned with Ricoh Aficio 3228C at 600 ppi, full color. Master images saved in tiff format.",17|27,,"Still image|Photographs|jpeg",RG30.0001.01|mil035.jpg|https://digital.lib.uiowa.edu/,,,,,,,,,,,,,,,,,,,,,,,,,,,,,,,,,,,,,,,,,,,,,,,,"<a href=""https://digital.lib.uiowa.edu/"" target=""_blank"">View this item in its source respository</a>",,,,,,,,,,,,,,,,,,,,,,,,,,,,,https://www.iowaheritage.org/files/original/23a6d99d8cd6de9fc6fdd888c7d3dfa9.jpg,"Remote Item","Iowa City Town and Campus Scenes",1,0
23569,https://www.iowaheritage.org/items/show/23569,"Officials and military officers standing at attention for Governor's Day ceremonies west of Armory, The University of Iowa, 1940s?","Military parades & ceremonies|University of Iowa|United States -- Iowa -- Iowa City|1940-1950|Military officers|Armory (Iowa City, Iowa)|United States. Army. Reserve Officers' Training Corps","Governor's Day was a yearly event where the Governor reviewed the ROTC troops.  The armory was located west of Field House.","Kent, Frederick W. (Frederick Wallace), 1894-1984",,"University of Iowa. Libraries. University Archives",1940/1949|2008-05,,"Educational use only, no other permissions given. U.S. and international copyright laws may protect this digital object. Commercial use or distribution of the object is not permitted without prior permission of the copyright holder.","Iowa City Town and Campus Scenes|Frederick W. Kent Collection of Photographs, 1866-2000|http://www.lib.uiowa.edu/collguides/?RG30.0001.01|Prints|Colleges and departments|Military|Military|Scanned with Ricoh Aficio 3228C at 600 ppi, full color. Master images saved in tiff format.",6|6,,"Still image|Photographs|jpeg",RG30.0001.01|ea0615.jpg|https://digital.lib.uiowa.edu/,,,,,,,,,,,,,,,,,,,,,,,,,,,,,,,,,,,,,,,,,,,,,,,,"<a href=""https://digital.lib.uiowa.edu/"" target=""_blank"">View this item in its source respository</a>",,,,,,,,,,,,,,,,,,,,,,,,,,,,,https://www.iowaheritage.org/files/original/b099f4f096b89a6e5c03ccb4b6145c47.jpg,"Remote Item","Iowa City Town and Campus Scenes",1,0
23574,https://www.iowaheritage.org/items/show/23574,"Officials and military officers standing at attention for Governor's Day ceremonies west of Armory, The University of Iowa, 1940s?","Military parades & ceremonies|United States. Army. Reserve Officers' Training Corps|University of Iowa|United States -- Iowa -- Iowa City|1940-1950|Military officers","Governor's Day was a yearly event where the Governor reviewed the ROTC troops.","Kent, Frederick W. (Frederick Wallace), 1894-1984",,"University of Iowa. Libraries. University Archives",1940/1949|2008-05,,"Educational use only, no other permissions given. U.S. and international copyright laws may protect this digital object. Commercial use or distribution of the object is not permitted without prior permission of the copyright holder.","Iowa City Town and Campus Scenes|Frederick W. Kent Collection of Photographs, 1866-2000|http://www.lib.uiowa.edu/collguides/?RG30.0001.01|Prints|Colleges and departments|Military|Military|Scanned with Ricoh Aficio 3228C at 600 ppi, full color. Master images saved in tiff format.",6|6,,"Still image|Photographs|jpeg",RG30.0001.01|ea0618.jpg|https://digital.lib.uiowa.edu/,,,,,,,,,,,,,,,,,,,,,,,,,,,,,,,,,,,,,,,,,,,,,,,,"<a href=""https://digital.lib.uiowa.edu/"" target=""_blank"">View this item in its source respository</a>",,,,,,,,,,,,,,,,,,,,,,,,,,,,,https://www.iowaheritage.org/files/original/e6696599f650e4e74eace58780a2ca39.jpg,"Remote Item","Iowa City Town and Campus Scenes",1,0
16699,https://www.iowaheritage.org/items/show/16699,"Officials walking among pine trees, Siberia, 1944","Government officials|Russia -- Siberia|1940-1950|Military officers|Trees",,unidentified,,"University of Iowa. Libraries. Special Collections Dept.",1944|2009-02-18,,"Educational use only, no other permissions given. U.S. and international copyright laws may protect this item. Commercial use or distribution of this digital object is not permitted without written permission of the University of Iowa Special Collections Dept.","Henry A. Wallace Collection|Henry Agard Wallace papers|http://lib.uiowa.edu/collguides/?MSC0177|Photographs & images|China-Siberia Trip, 1944|Scanned with Ricoh 3228C scanner at 600 ppi. Archival tiff available.",jpeg,,"Still image|Photographs",MSC0177|7|72|wal73-072.jpg|https://digital.lib.uiowa.edu/,,,,,,,,,,,,,,,,,,,,,,,,,,,,,,,,,,,,,,,,,,,,,,,,"<a href=""https://digital.lib.uiowa.edu/"" target=""_blank"">View this item in its source respository</a>",,,,,,,,,,,,,,,,,,,,,,,,,,,,,https://www.iowaheritage.org/files/original/b58610a8e566fb3da5af071fe4940eae.jpg,"Remote Item","Henry A. Wallace Collection",1,0
21869,https://www.iowaheritage.org/items/show/21869,"Rifle team and captain near Armory, The University of Iowa, 1918","Cadets|University of Iowa. Dept. of Military Science|United States -- Iowa -- Iowa City|1910-1920|Military officers|Military training",,"Kent, Frederick W. (Frederick Wallace), 1894-1984",,"The University of Iowa. Libraries. University Archives",1918|2008-03-19,,"Educational use only, no other permissions given. U.S. and international copyright laws may protect this digital object. Commercial use or distribution of the object is not permitted without prior permission of the copyright holder.","Iowa City Town and Campus Scenes|Frederick W. Kent collection of photographs, 1866-2000|http://www.lib.uiowa.edu/collguides/?RG30.0001.01|Prints|Colleges and departments|Military|Military|Scanned with Ricoh Aficio 3228C at 600 ppi, full color. Master images saved in tiff format.",11|19,,"Still image|Photographs|jpeg",RG30.0001.01|mil347.jpg|https://digital.lib.uiowa.edu/,,,,,,,,,,,,,,,,,,,,,,,,,,,,,,,,,,,,,,,,,,,,,,,,"<a href=""https://digital.lib.uiowa.edu/"" target=""_blank"">View this item in its source respository</a>",,,,,,,,,,,,,,,,,,,,,,,,,,,,,https://www.iowaheritage.org/files/original/2c7485c38130be114e1ab9d1cbdc235f.jpg,"Remote Item","Iowa City Town and Campus Scenes",1,0
