 




﻿"Item Id","Item URI","Dublin Core:Title","Dublin Core:Subject","Dublin Core:Description","Dublin Core:Creator","Dublin Core:Source","Dublin Core:Publisher","Dublin Core:Date","Dublin Core:Contributor","Dublin Core:Rights","Dublin Core:Relation","Dublin Core:Format","Dublin Core:Language","Dublin Core:Type","Dublin Core:Identifier","Dublin Core:Coverage","Item Type Metadata:Text","Item Type Metadata:Interviewer","Item Type Metadata:Interviewee","Item Type Metadata:Location","Item Type Metadata:Transcription","Item Type Metadata:Local URL","Item Type Metadata:Original Format","Item Type Metadata:Physical Dimensions","Item Type Metadata:Duration","Item Type Metadata:Compression","Item Type Metadata:Producer","Item Type Metadata:Director","Item Type Metadata:Bit Rate/Frequency","Item Type Metadata:Time Summary","Item Type Metadata:Email Body","Item Type Metadata:Subject Line","Item Type Metadata:From","Item Type Metadata:To","Item Type Metadata:CC","Item Type Metadata:BCC","Item Type Metadata:Number of Attachments","Item Type Metadata:Standards","Item Type Metadata:Objectives","Item Type Metadata:Materials","Item Type Metadata:Lesson Plan Text","Item Type Metadata:URL","Item Type Metadata:Event Type","Item Type Metadata:Participants","Item Type Metadata:Birth Date","Item Type Metadata:Birthplace","Item Type Metadata:Death Date","Item Type Metadata:Occupation","Item Type Metadata:Biographical Text","Item Type Metadata:Bibliography","Item Type Metadata:Digital Reproduction Information","Item Type Metadata:Repository","Item Type Metadata:Repository Collection","Item Type Metadata:Contact information.","Item Type Metadata:File Name","Item Type Metadata:Notes","Item Type Metadata:Digital item created","Item Type Metadata:Digital item modified","Item Type Metadata:Executive Orders","Item Type Metadata:Record Created","Item Type Metadata:Record Modified","Item Type Metadata:Transcription2","Item Type Metadata:Source URL","Omeka Legacy File:Additional Creator","Omeka Legacy File:Transcriber","Omeka Legacy File:Producer","Omeka Legacy File:Render Device","Omeka Legacy File:Render Details","Omeka Legacy File:Capture Date","Omeka Legacy File:Capture Device","Omeka Legacy File:Capture Details","Omeka Legacy File:Change History","Omeka Legacy File:Watermark","Omeka Legacy File:Encryption","Omeka Legacy File:Compression","Omeka Legacy File:Post Processing","Omeka Image File:Width","Omeka Image File:Height","Omeka Image File:Bit Depth","Omeka Image File:Channels","Omeka Image File:Exif String","Omeka Image File:Exif Array","Omeka Image File:IPTC String","Omeka Image File:IPTC Array","Omeka Video File:Bitrate","Omeka Video File:Duration","Omeka Video File:Sample Rate","Omeka Video File:Codec","Omeka Video File:Width","Omeka Video File:Height",tags,file,itemType,collection,public,featured
15158,https://www.iowaheritage.org/items/show/15158,"Clarion, Iowa. CNW (ex CGW)","Railroad stations|Chicago and North Western Railway Company|United States -- Iowa -- Wright County -- Clarion|1990-2000|Buildings|Chicago Great Western Railroad Company","Shed near tracks. ""[L]ooks N & E. Ron Sims photo, 2717 Cornell, D.M. IA 50313""--Photograph verso.","Sims, Ronald D.",,"University of Iowa. Libraries. Special Collections Dept.",1990-09-28|2006-07-10,,"Educational use only, no other permissions given. U.S. and international copyright laws may protect this digital image. Commercial use or distribution of the image is not permitted without prior permission of the copyright holder. For information see:  http://www.lib.uiowa.edu/spec-coll/help/copyright.html","John P. Vander Maas Railroadiana|John P. Vander Maas Railroadiana Collection|MSC0468|http://lib.uiowa.edu/collguides/?MSC0468|Vol. 47, Depots by county",8|11,,"Still image|Photographs|jpeg",47clarion04.jpg|169946290|https://digital.lib.uiowa.edu/,,,,,,,,,,,,,,,,,,,,,,,,,,,,,,,,,,,,,,,,,,,,,,,,"<a href=""https://digital.lib.uiowa.edu/"" target=""_blank"">View this item in its source respository</a>",,,,,,,,,,,,,,,,,,,,,,,,,,,,,https://www.iowaheritage.org/files/original/2878edfba7f92ba1764980f3f7b27b35.jpg,"Remote Item","John P. Vander Maas Railroadiana",1,0
15109,https://www.iowaheritage.org/items/show/15109,"Clarion, Iowa. CGW","Railroad stations|Chicago Great Western Railroad Company|United States -- Iowa -- Wright County -- Clarion|Buildings",,unknown,,"University of Iowa. Libraries. Special Collections Dept.",Unknown|2006-06-29,,"Educational use only, no other permissions given. U.S. and international copyright laws may protect this digital image. Commercial use or distribution of the image is not permitted without prior permission of the copyright holder. For information see:  http://www.lib.uiowa.edu/spec-coll/help/copyright.html","John P. Vander Maas Railroadiana|John P. Vander Maas Railroadiana Collection|MSC0468|http://lib.uiowa.edu/collguides/?MSC0468|vol. 47, Depots by County",9|14,,"Still image|Postcards|jpeg",169946290|https://digital.lib.uiowa.edu/,,,,,,,,,,,,,,,,,,,,,,,,,,,,,,,,,,,,,,,,,,,,,,,,"<a href=""https://digital.lib.uiowa.edu/"" target=""_blank"">View this item in its source respository</a>",,,,,,,,,,,,,,,,,,,,,,,,,,,,,https://www.iowaheritage.org/files/original/5b3e01e602754f5234d8409700419b4d.jpg,"Remote Item","John P. Vander Maas Railroadiana",1,0
15152,https://www.iowaheritage.org/items/show/15152,"Clarion, IA. RI-CGW","Railroad stations|Chicago, Rock Island & Pacific Rail Road Co.|United States -- Iowa -- Wright County -- Clarion|1970-1980|Buildings|Railroad signals|Chicago Great Western Railroad Company","Tower and signal. ""R.I. - C.G.W. tower. View looks E. Ronald D. Sims, 2717 Cornell St., Des Moines, Iowa 50313, Railroad Photography""--Photograph verso.","Sims, Ronald D.",,"University of Iowa. Libraries. Special Collections Dept.",1970-10-11|2006-07-10,,"Educational use only, no other permissions given. U.S. and international copyright laws may protect this digital image. Commercial use or distribution of the image is not permitted without prior permission of the copyright holder. For information see:  http://www.lib.uiowa.edu/spec-coll/help/copyright.html","John P. Vander Maas Railroadiana|John P. Vander Maas Railroadiana Collection|MSC0468|http://lib.uiowa.edu/collguides/?MSC0468|Vol. 47, Depots by county",8|13,,"Still image|Photographs|jpeg",47clarion03.jpg|169946290|https://digital.lib.uiowa.edu/,,,,,,,,,,,,,,,,,,,,,,,,,,,,,,,,,,,,,,,,,,,,,,,,"<a href=""https://digital.lib.uiowa.edu/"" target=""_blank"">View this item in its source respository</a>",,,,,,,,,,,,,,,,,,,,,,,,,,,,,https://www.iowaheritage.org/files/original/d853d6314fa70ca4be81608ca6393a41.jpg,"Remote Item","John P. Vander Maas Railroadiana",1,0
14755,https://www.iowaheritage.org/items/show/14755,"Churchville, IA. CGW","Railroad stations|Chicago Great Western Railroad Company|United States -- Iowa -- Warren County -- Churchville|1980-1990","Bridge over right of way. ""View looks N. Ron Sims photo, 2717 Cornell, D.M. IA 50313""--Photograph verso.","Sims, Ronald D.",,"University of Iowa. Libraries. Special Collections Dept.",1986-12-05|2006-05-10,,"Educational use only, no other permissions given. U.S. and international copyright laws may protect this digital image. Commercial use or distribution of the image is not permitted without prior permission of the copyright holder. For information see:  http://www.lib.uiowa.edu/spec-coll/help/copyright.html","John P. Vander Maas Railroadiana|John P. Vander Maas Railroadiana Collection|MSC0468|http://lib.uiowa.edu/collguides/?MSC0468|Vol. 47, Depots by county",8|12,,"Still image|Photographs|jpeg",47churchville01.jpg|169946290|https://digital.lib.uiowa.edu/,,,,,,,,,,,,,,,,,,,,,,,,,,,,,,,,,,,,,,,,,,,,,,,,"<a href=""https://digital.lib.uiowa.edu/"" target=""_blank"">View this item in its source respository</a>",,,,,,,,,,,,,,,,,,,,,,,,,,,,,https://www.iowaheritage.org/files/original/38526a75463eb44033e3afb16595b4f5.jpg,"Remote Item","John P. Vander Maas Railroadiana",1,0
12422,https://www.iowaheritage.org/items/show/12422,"Cedar Falls, Iowa. CGW","Railroad stations|Chicago Great Western Railroad Company|United States -- Iowa -- Black Hawk County -- Cedar Falls|1950-1960|Buildings","Single story wooden depot.",unknown,,"University of Iowa. Libraries. Special Collections Dept.",1957-07-21|2005-05-05,,"Educational use only, no other permissions given. U.S. and international copyright laws may protect this digital image. Commercial use or distribution of the image is not permitted without prior permission of the copyright holder. For information see:  http://www.lib.uiowa.edu/spec-coll/help/copyright.html","John P. Vander Maas Railroadiana|John P. Vander Maas Railroadiana Collection|MSC0468|http://lib.uiowa.edu/collguides/?MSC0468|Vol. 40, Depots by county",7|12,,"Still image|Photographs|jpeg",40cedarfalls01.jpg|169946290|https://digital.lib.uiowa.edu/,,,,,,,,,,,,,,,,,,,,,,,,,,,,,,,,,,,,,,,,,,,,,,,,"<a href=""https://digital.lib.uiowa.edu/"" target=""_blank"">View this item in its source respository</a>",,,,,,,,,,,,,,,,,,,,,,,,,,,,,https://www.iowaheritage.org/files/original/8c231df9b5d9058aa630b74a4639ff23.jpg,"Remote Item","John P. Vander Maas Railroadiana",1,0
12504,https://www.iowaheritage.org/items/show/12504,"Cedar Falls Jct, Iowa. CGW","Railroad stations|Chicago Great Western Railroad Company|United States -- Iowa -- Black Hawk County -- Cedar Falls Junction|1920-1930|Buildings|Railroad cars","Single story wooden depot with  railroad car and engine on tracks. Man standing next to the railroad cars.  Cart parked next to the depot. ""BlackHawk, Cedar Falls Jct - new.  Circa 1925-1935.  Shed.  CG&W""--Postcard verso.",unknown,,"University of Iowa. Libraries. Special Collections Dept.",1925/1935|2005-09-01,,"Educational use only, no other permissions given. U.S. and international copyright laws may protect this digital image. Commercial use or distribution of the image is not permitted without prior permission of the copyright holder. For information see:  http://www.lib.uiowa.edu/spec-coll/help/copyright.html","John P. Vander Maas Railroadiana|John P. Vander Maas Railroadiana Collection|MSC0468|http://lib.uiowa.edu/collguides/?MSC0468|Vol. 40, Depots by county",9|14,,"Still image|Postcards|jpeg",40cedarfallsjct03.jpg|169946290|https://digital.lib.uiowa.edu/,,,,,,,,,,,,,,,,,,,,,,,,,,,,,,,,,,,,,,,,,,,,,,,,"<a href=""https://digital.lib.uiowa.edu/"" target=""_blank"">View this item in its source respository</a>",,,,,,,,,,,,,,,,,,,,,,,,,,,,,https://www.iowaheritage.org/files/original/a81fbe8b8f7dffc1bf9ed8e75accd0da.jpg,"Remote Item","John P. Vander Maas Railroadiana",1,0
14597,https://www.iowaheritage.org/items/show/14597,"Carroll, Iowa. CGW","Railroad stations|Chicago Great Western Railroad Company|United States -- Iowa -- Carroll County -- Carroll|1910-1920|Buildings|Carriages & coaches|Railroad signals","Single story brick depot with cart and signal. ""C&GW Depot, Carroll, Iowa 1917""--Caption on postcard.",unknown,,"University of Iowa. Libraries. Special Collections Dept.",1917|2006-04-21,,"Educational use only, no other permissions given. U.S. and international copyright laws may protect this digital image. Commercial use or distribution of the image is not permitted without prior permission of the copyright holder. For information see:  http://www.lib.uiowa.edu/spec-coll/help/copyright.html","John P. Vander Maas Railroadiana|John P. Vander Maas Railroadiana Collection|MSC0468|http://lib.uiowa.edu/collguides/?MSC0468|Vol. 41, Depots by county",9|14,,"Still image|Postcards|jpeg",41carroll03.jpg|169946290|https://digital.lib.uiowa.edu/,,,,,,,,,,,,,,,,,,,,,,,,,,,,,,,,,,,,,,,,,,,,,,,,"<a href=""https://digital.lib.uiowa.edu/"" target=""_blank"">View this item in its source respository</a>",,,,,,,,,,,,,,,,,,,,,,,,,,,,,https://www.iowaheritage.org/files/original/d5c03eec66be2fe81ce3dbb425766f49.jpg,"Remote Item","John P. Vander Maas Railroadiana",1,0
12694,https://www.iowaheritage.org/items/show/12694,"Carroll, IA. CGW","Railroad stations|Chicago Great Western Railroad Company|United States -- Iowa -- Carroll County -- Carroll|1960-1970|Buildings|Automobiles|Railroad signals","Two sets of tracks curving to the left.  Single story brick depot with signal on pole.  Automobiles parked outside of depot.  Other buildings in distance.  Street sign for one way street.  Railroad crossing sign. ""James L. Rueber, 2509 South Shore Driv[e], Clear Lake, Iowa 504""--Photograph verso.","Rueber, James L.",,"University of Iowa. Libraries. Special Collections Dept.",1967-07-21|2005-09-16,,"Educational use only, no other permissions given. U.S. and international copyright laws may protect this digital image. Commercial use or distribution of the image is not permitted without prior permission of the copyright holder. For information see:  http://www.lib.uiowa.edu/spec-coll/help/copyright.html","John P. Vander Maas Railroadiana|John P. Vander Maas Railroadiana Collection|MSC0468|http://lib.uiowa.edu/collguides/?MSC0468|Vol. 41, Depots by county",13|17,,"Still image|Photographs|jpeg",41carroll02.jpg|169946290|https://digital.lib.uiowa.edu/,,,,,,,,,,,,,,,,,,,,,,,,,,,,,,,,,,,,,,,,,,,,,,,,"<a href=""https://digital.lib.uiowa.edu/"" target=""_blank"">View this item in its source respository</a>",,,,,,,,,,,,,,,,,,,,,,,,,,,,,https://www.iowaheritage.org/files/original/6c379884c7c248cfe0bb2cd6401bb455.jpg,"Remote Item","John P. Vander Maas Railroadiana",1,0
12791,https://www.iowaheritage.org/items/show/12791,"Burchinal, Iowa. CGW","Railroad stations|Chicago Great Western Railroad Company|United States -- Iowa -- Cerro Gordo County -- Burchinal|1970-1980|Buildings|Railroad cars","Snow covered ground.  Sign for Burchinal on two short poles.  Large building with railroad car next to it.",unknown,,"University of Iowa. Libraries. Special Collections Dept.",1978-11-25|2005-09-21,,"Educational use only, no other permissions given. U.S. and international copyright laws may protect this digital image. Commercial use or distribution of the image is not permitted without prior permission of the copyright holder. For information see:  http://www.lib.uiowa.edu/spec-coll/help/copyright.html","John P. Vander Maas Railroadiana|John P. Vander Maas Railroadiana Collection|MSC0468|http://lib.uiowa.edu/collguides/?MSC0468|Vol. 41, Depots by county",12|10,,"Still image|Photographs|jpeg",41burchinal01.jpg|169946290|https://digital.lib.uiowa.edu/,,,,,,,,,,,,,,,,,,,,,,,,,,,,,,,,,,,,,,,,,,,,,,,,"<a href=""https://digital.lib.uiowa.edu/"" target=""_blank"">View this item in its source respository</a>",,,,,,,,,,,,,,,,,,,,,,,,,,,,,https://www.iowaheritage.org/files/original/1f60079216fbfaeebbf64ae211483ac6.jpg,"Remote Item","John P. Vander Maas Railroadiana",1,0
12793,https://www.iowaheritage.org/items/show/12793,"Burchinal, Iowa.","Railroad stations|Chicago Great Western Railroad Company|United States -- Iowa -- Cerro Gordo County -- Burchinal|Buildings|Grain elevators","Single story depot with grain elevator next to it.  Other buildings behind.  People on platform. ""Elevator and Gt. Western depot, Burchinal, IA""--Caption on photograph.  ""James L. Rueber, 2509 South Shore Drive, Clear Lake, Iowa 50428""--Photograph verso.","Rueber, James L.",,"University of Iowa. Libraries. Special Collections Dept.",Unknown|2005-09-21,,"Educational use only, no other permissions given. U.S. and international copyright laws may protect this digital image. Commercial use or distribution of the image is not permitted without prior permission of the copyright holder. For information see:  http://www.lib.uiowa.edu/spec-coll/help/copyright.html","John P. Vander Maas Railroadiana|John P. Vander Maas Railroadiana Collection|MSC0468|http://lib.uiowa.edu/collguides/?MSC0468|Vol. 41, Depots by county",13|17,,"Still image|Photographs|jpeg",41burchinal02.jpg|169946290|https://digital.lib.uiowa.edu/,,,,,,,,,,,,,,,,,,,,,,,,,,,,,,,,,,,,,,,,,,,,,,,,"<a href=""https://digital.lib.uiowa.edu/"" target=""_blank"">View this item in its source respository</a>",,,,,,,,,,,,,,,,,,,,,,,,,,,,,https://www.iowaheritage.org/files/original/a649bd10236f5bc23f94e85c181ad695.jpg,"Remote Item","John P. Vander Maas Railroadiana",1,0
