 




﻿"Item Id","Item URI","Dublin Core:Title","Dublin Core:Subject","Dublin Core:Description","Dublin Core:Creator","Dublin Core:Source","Dublin Core:Publisher","Dublin Core:Date","Dublin Core:Contributor","Dublin Core:Rights","Dublin Core:Relation","Dublin Core:Format","Dublin Core:Language","Dublin Core:Type","Dublin Core:Identifier","Dublin Core:Coverage","Item Type Metadata:Text","Item Type Metadata:Interviewer","Item Type Metadata:Interviewee","Item Type Metadata:Location","Item Type Metadata:Transcription","Item Type Metadata:Local URL","Item Type Metadata:Original Format","Item Type Metadata:Physical Dimensions","Item Type Metadata:Duration","Item Type Metadata:Compression","Item Type Metadata:Producer","Item Type Metadata:Director","Item Type Metadata:Bit Rate/Frequency","Item Type Metadata:Time Summary","Item Type Metadata:Email Body","Item Type Metadata:Subject Line","Item Type Metadata:From","Item Type Metadata:To","Item Type Metadata:CC","Item Type Metadata:BCC","Item Type Metadata:Number of Attachments","Item Type Metadata:Standards","Item Type Metadata:Objectives","Item Type Metadata:Materials","Item Type Metadata:Lesson Plan Text","Item Type Metadata:URL","Item Type Metadata:Event Type","Item Type Metadata:Participants","Item Type Metadata:Birth Date","Item Type Metadata:Birthplace","Item Type Metadata:Death Date","Item Type Metadata:Occupation","Item Type Metadata:Biographical Text","Item Type Metadata:Bibliography","Item Type Metadata:Digital Reproduction Information","Item Type Metadata:Repository","Item Type Metadata:Repository Collection","Item Type Metadata:Contact information.","Item Type Metadata:File Name","Item Type Metadata:Notes","Item Type Metadata:Digital item created","Item Type Metadata:Digital item modified","Item Type Metadata:Executive Orders","Item Type Metadata:Record Created","Item Type Metadata:Record Modified","Item Type Metadata:Transcription2","Item Type Metadata:Source URL","Omeka Legacy File:Additional Creator","Omeka Legacy File:Transcriber","Omeka Legacy File:Producer","Omeka Legacy File:Render Device","Omeka Legacy File:Render Details","Omeka Legacy File:Capture Date","Omeka Legacy File:Capture Device","Omeka Legacy File:Capture Details","Omeka Legacy File:Change History","Omeka Legacy File:Watermark","Omeka Legacy File:Encryption","Omeka Legacy File:Compression","Omeka Legacy File:Post Processing","Omeka Image File:Width","Omeka Image File:Height","Omeka Image File:Bit Depth","Omeka Image File:Channels","Omeka Image File:Exif String","Omeka Image File:Exif Array","Omeka Image File:IPTC String","Omeka Image File:IPTC Array","Omeka Video File:Bitrate","Omeka Video File:Duration","Omeka Video File:Sample Rate","Omeka Video File:Codec","Omeka Video File:Width","Omeka Video File:Height",tags,file,itemType,collection,public,featured
9573,https://www.iowaheritage.org/items/show/9573,"Picture of a man parking his car.","Human nature|Automobiles.|automobiles|traffic|parking.",,"Darling, Jay N. (Jay Norwood), 1876-1962","The Editorial cartoons of J.N. ""Ding"" Darling [electronic resource] : The Cowles Collection, Drake University, 1912-1962",,1947/11/23|1947,,"Copyright is owned by the ""Ding"" Darling Wildlife Society; it is administered on behalf of the Society by The University of Iowa. While use within the classroom is encouraged without specific authorization, publishing this cartoon in any format requires written permission. See policy and permissions procedure at: http://www.lib.uiowa.edu/spec-coll/services/dingdarling_fees.html","Cowles Library, Drake University, 2507 University Ave., Des Moines, IA 50311-4505.",,,,"471123.jpg|http://ddr.lib.drake.edu/u?/ddarling,6503",,,,,,,,,,,,,,,,,,,,,,,,,,,,,,,,,,,,,,,,,,,,,,,,"<a href=""http://ddr.lib.drake.edu/u?/ddarling,6503"" target=""_blank"">View this item in its source respository</a>",,,,,,,,,,,,,,,,,,,,,,,,,,,,,https://www.iowaheritage.org/files/original/ef3b3c4f5ee0a4d5b30edaf7ab23fc40.jpg,"Remote Item","Editorial Cartoons of J.N. ""Ding"" Darling, Drake University",1,0
9612,https://www.iowaheritage.org/items/show/9612,"Next stop, stratosphere.","Economics|Jack|inflation|labor|unions|wages|C.I.O.|automobiles|ordinary citizen.",,"Darling, Jay N. (Jay Norwood), 1876-1962","The Editorial cartoons of J.N. ""Ding"" Darling [electronic resource] : The Cowles Collection, Drake University, 1912-1962",,1948/02/16|1948,,"Copyright is owned by the ""Ding"" Darling Wildlife Society; it is administered on behalf of the Society by The University of Iowa. While use within the classroom is encouraged without specific authorization, publishing this cartoon in any format requires written permission. See policy and permissions procedure at: http://www.lib.uiowa.edu/spec-coll/services/dingdarling_fees.html","Cowles Library, Drake University, 2507 University Ave., Des Moines, IA 50311-4505.",,,,"480216.jpg|http://ddr.lib.drake.edu/u?/ddarling,6542",,,,,,,,,,,,,,,,,,,,,,,,,,,,,,,,,,,,,,,,,,,,,,,,"<a href=""http://ddr.lib.drake.edu/u?/ddarling,6542"" target=""_blank"">View this item in its source respository</a>",,,,,,,,,,,,,,,,,,,,,,,,,,,,,https://www.iowaheritage.org/files/original/e21de0545d8e93d62979bce4ff306ba7.jpg,"Remote Item","Editorial Cartoons of J.N. ""Ding"" Darling, Drake University",1,0
9671,https://www.iowaheritage.org/items/show/9671,"They say it was a nice quiet day in town.","Human nature|Automobiles|population|automobiles|traffic|traffic.",,"Darling, Jay N. (Jay Norwood), 1876-1962","The Editorial cartoons of J.N. ""Ding"" Darling [electronic resource] : The Cowles Collection, Drake University, 1912-1962",,1948/07/06|1948,,"Copyright is owned by the ""Ding"" Darling Wildlife Society; it is administered on behalf of the Society by The University of Iowa. While use within the classroom is encouraged without specific authorization, publishing this cartoon in any format requires written permission. See policy and permissions procedure at: http://www.lib.uiowa.edu/spec-coll/services/dingdarling_fees.html","Cowles Library, Drake University, 2507 University Ave., Des Moines, IA 50311-4505.",,,,"480706.jpg|http://ddr.lib.drake.edu/u?/ddarling,6601",,,,,,,,,,,,,,,,,,,,,,,,,,,,,,,,,,,,,,,,,,,,,,,,"<a href=""http://ddr.lib.drake.edu/u?/ddarling,6601"" target=""_blank"">View this item in its source respository</a>",,,,,,,,,,,,,,,,,,,,,,,,,,,,,https://www.iowaheritage.org/files/original/093aa92ba19bbdcf4d19adaa91d69167.jpg,"Remote Item","Editorial Cartoons of J.N. ""Ding"" Darling, Drake University",1,0
10411,https://www.iowaheritage.org/items/show/10411,"Automobile in front of Loveland type cut, Loveland, Iowa, 1925","Geology|United States -- Iowa -- Pottawattamie County -- Loveland|1920-1930|Cenozoic -- Pleistocene|Loveland type cut|Cliffs|Automobiles",,"Apfel, Earl Taylor, 1892-","Photographs scanned using Epson Expression 1680 scanner at 300 ppi, 8-bit greyscale.","University of Iowa. Dept. of Geoscience. Paleontology Repository|Contact Tiffany Adrain (tiffany-adrain@uiowa.edu) at The University of Iowa Paleontology Repository http://www.uiowa.edu/~geology/paleo",1925|2006-03-27,,"This digital image may be used for educational purposes, as long as it is not altered in any way. No commercial reproduction or distribution of this file is permitted without permission.","Calvin Geological Photographs|This digital collection contains the geology-related images originally digitized for the Dept. of Geosciences' Calvin web exhibit: http://www.uiowa.edu/~calvin/calvin.htm . Calvin's images of Iowa City can be viewed in the Iowa City Town and Campus Scenes Digital Collection: http://digital.lib.uiowa.edu/ictcs",jpeg|5|7,,"Still image|Photographs; Dry collodion negatives",7206|6177|173611416|https://digital.lib.uiowa.edu/,,,,,,,,,,,,,,,,,,,,,,,,,,,,,,,,,,,,,,,,,,,,,,,,"<a href=""https://digital.lib.uiowa.edu/"" target=""_blank"">View this item in its source respository</a>",,,,,,,,,,,,,,,,,,,,,,,,,,,,,https://www.iowaheritage.org/files/original/96aff45f5c6f46f387986e7d30af73fe.jpg,"Remote Item","African American Women in Iowa Collection",1,0
12267,https://www.iowaheritage.org/items/show/12267,"Fontanelle, Iowa. CBQ","Railroad stations|Chicago, Burlington & Quincy Railroad Company|United States -- Iowa -- Adair County -- Fontanelle|1950-1960|Buildings|Automobiles|Railroad cars","Depot with cars and railroad cars in front and behind and silos in the background.  Railroad tracks in foreground.","Lawler, R. E.",,"University of Iowa. Libraries. Special Collections Dept.",1955-03-23|2005-02-22,,"Educational use only, no other permissions given. U.S. and international copyright laws may protect this digital image. Commercial use or distribution of the image is not permitted without prior permission of the copyright holder. For information see:  http://www.lib.uiowa.edu/spec-coll/help/copyright.html","John P. Vander Maas Railroadiana|John P. Vander Maas Railroadiana Collection|MSC0468|http://lib.uiowa.edu/collguides/?MSC0468|Vol. 40, Depots by county",8|11,,"Still image|Photographs|jpeg",40fontanelle01.jpg|169946290|https://digital.lib.uiowa.edu/,,,,,,,,,,,,,,,,,,,,,,,,,,,,,,,,,,,,,,,,,,,,,,,,"<a href=""https://digital.lib.uiowa.edu/"" target=""_blank"">View this item in its source respository</a>",,,,,,,,,,,,,,,,,,,,,,,,,,,,,https://www.iowaheritage.org/files/original/5f0a39045d7f3ebb3d3c7a985c128312.jpg,"Remote Item","John P. Vander Maas Railroadiana",1,0
12279,https://www.iowaheritage.org/items/show/12279,"Greenfield, Iowa. CBQ","Railroad stations|Chicago, Burlington & Quincy Railroad Company|United States -- Iowa -- Adair County -- Greenfield|1960-1970|Buildings|Railroad cars|Automobiles","Brick depot with pickup truck and car in front and railroad car beside.  Man working next to railroad car.  Grain elevator on right.  ""view looks W""--photograph verso.","Sims, Ronald D.",,"University of Iowa. Libraries. Special Collections Dept.",1960-06-24|2005-02-22,,"Educational use only, no other permissions given. U.S. and international copyright laws may protect this digital image. Commercial use or distribution of the image is not permitted without prior permission of the copyright holder. For information see:  http://www.lib.uiowa.edu/spec-coll/help/copyright.html","John P. Vander Maas Railroadiana|John P. Vander Maas Railroadiana Collection|MSC0468|http://lib.uiowa.edu/collguides/?MSC0468|Vol. 40, Depots by county",8|11,,"Still image|Photographs|jpeg",40greenfield01.jpg|169946290|https://digital.lib.uiowa.edu/,,,,,,,,,,,,,,,,,,,,,,,,,,,,,,,,,,,,,,,,,,,,,,,,"<a href=""https://digital.lib.uiowa.edu/"" target=""_blank"">View this item in its source respository</a>",,,,,,,,,,,,,,,,,,,,,,,,,,,,,https://www.iowaheritage.org/files/original/440aa732b7d734224bee9e04b6bd23d7.jpg,"Remote Item","John P. Vander Maas Railroadiana",1,0
12281,https://www.iowaheritage.org/items/show/12281,"Orient, Iowa. BN","Railroad stations|Burlington Northern Railroad Company|United States -- Iowa -- Adair County -- Orient|1980-1990|Buildings|Grain elevators|Automobiles","Railroad tracks running into the background.  Trucks parked on the left.  Grain elevators on the right.  Buildings in the background on the right of the tracks.",unknown,,"University of Iowa. Libraries. Special Collections Dept.",1983-05-14|2005-03-17,,"Educational use only, no other permissions given. U.S. and international copyright laws may protect this digital image. Commercial use or distribution of the image is not permitted without prior permission of the copyright holder. For information see:  http://www.lib.uiowa.edu/spec-coll/help/copyright.html","John P. Vander Maas Railroadiana|John P. Vander Maas Railroadiana Collection|MSC0468|http://lib.uiowa.edu/collguides/?MSC0468|Vol. 40, Depots by county",8|12,,"Still image|Photographs|jpeg",40orient02.jpg|169946290|https://digital.lib.uiowa.edu/,,,,,,,,,,,,,,,,,,,,,,,,,,,,,,,,,,,,,,,,,,,,,,,,"<a href=""https://digital.lib.uiowa.edu/"" target=""_blank"">View this item in its source respository</a>",,,,,,,,,,,,,,,,,,,,,,,,,,,,,https://www.iowaheritage.org/files/original/e7c2e3558b8f8ee8de12909759d27f59.jpg,"Remote Item","John P. Vander Maas Railroadiana",1,0
12283,https://www.iowaheritage.org/items/show/12283,"Orient, Iowa. CBQ","Railroad stations|Chicago, Burlington & Quincy Railroad Company|United States -- Iowa -- Adair County -- Orient|1960-1970|Buildings|Automobiles|Railroad cars","Wooden depot with car parked next to it.  Train sitting on tracks. ""view looks NW""--Photograph verso.","Sims, Ronald D.",,"University of Iowa. Libraries. Special Collections Dept.",1960-06-24|2005-03-16,,"Educational use only, no other permissions given. U.S. and international copyright laws may protect this digital image. Commercial use or distribution of the image is not permitted without prior permission of the copyright holder. For information see:  http://www.lib.uiowa.edu/spec-coll/help/copyright.html","John P. Vander Maas Railroadiana|John P. Vander Maas Railroadiana Collection|MSC0468|http://lib.uiowa.edu/collguides/?MSC0468|Vol. 40, Depots by county",8|12,,"Still image|Photographs|jpeg",40orient01.jpg|169946290|https://digital.lib.uiowa.edu/,,,,,,,,,,,,,,,,,,,,,,,,,,,,,,,,,,,,,,,,,,,,,,,,"<a href=""https://digital.lib.uiowa.edu/"" target=""_blank"">View this item in its source respository</a>",,,,,,,,,,,,,,,,,,,,,,,,,,,,,https://www.iowaheritage.org/files/original/72d96c4dc5cb290b3836d2599ab5849c.jpg,"Remote Item","John P. Vander Maas Railroadiana",1,0
12291,https://www.iowaheritage.org/items/show/12291,"Lansing, Iowa. MILW","Railroad stations|Chicago, Rock Island & Pacific Rail Road Co.|United States -- Iowa -- Allamakee County -- Lansing|1950-1960|Buildings|Railroad cars|Automobiles|Railroad signals","Small wooden depot with two garage doors on a  loading dock.  A truck is backed up to a railroad car.   There are a couple of railroad cars sitting on the tracks to the right of the depot.  A signal light towers above the depot from behind.",unknown,,"The University of Iowa Libraries Special Collections: http://www.lib.uiowa.edu/spec-coll/",1956-07-14|2005-03-23,,"Educational use only, no other permissions given. U.S. and international copyright laws may protect this digital image. Commercial use or distribution of the image is not permitted without prior permission of the copyright holder. For information see:  http://www.lib.uiowa.edu/spec-coll/help/copyright.html","John P. Vander Maas Railroadiana|John P. Vander Maas Railroadiana Collection|MSC0468|http://lib.uiowa.edu/collguides/?MSC0468|Vol. 40, Depots by county",8|12,,"Still image|Photographs|jpeg",40lansing01.jpg|169946290|https://digital.lib.uiowa.edu/,,,,,,,,,,,,,,,,,,,,,,,,,,,,,,,,,,,,,,,,,,,,,,,,"<a href=""https://digital.lib.uiowa.edu/"" target=""_blank"">View this item in its source respository</a>",,,,,,,,,,,,,,,,,,,,,,,,,,,,,https://www.iowaheritage.org/files/original/df14b030970541e5c54ac366e063059c.jpg,"Remote Item","John P. Vander Maas Railroadiana",1,0
12301,https://www.iowaheritage.org/items/show/12301,"Cincinnati, Iowa EXCBQ","Railroad stations|Chicago, Burlington & Quincy Railroad Company Expedited Service|United States -- Iowa -- Appanoose County -- Cincinnati|1950-1960|Buildings|Automobiles","Single story wooden depot with junk piled in front and an old car parked next to it. ""[Bur]lington ex-depot now a junk yard.  Old depot...Cincinnati, Iowa was abandoned between [S]edan, Iowa and Unionville, MO.  [T]he Railway Guide of 1950 lists daily except [S]unday motor train service bewteen Burlington [a]nd Cincinnati (113 miles) Cincinnati being the [e]nd of the run. Also mixed train service from [S]edan to Laclede through Cincinnati but that [w]as 1950.  Today all tracks are gone and the dep[ot] [i]s now serving as office of a scrap yards in it [s]ame location.  Evidence of the right of way is [s]till very plain""--Photograph verso. "" Cincinnati EXQ. James A. Williams, .....van Road, Route 2, Lee's Summit, Missouri""--Photograph verso.","Williams, James A.",,"University of Iowa. Libraries. Special Collections Dept.",1954|2005-03-31,,"Educational use only, no other permissions given. U.S. and international copyright laws may protect this digital image. Commercial use or distribution of the image is not permitted without prior permission of the copyright holder. For information see:  http://www.lib.uiowa.edu/spec-coll/help/copyright.html","John P. Vander Maas Railroadiana|John P. Vander Maas Railroadiana Collection|MSC0468|http://lib.uiowa.edu/collguides/?MSC0468|Vol. 40, Depots by county",9|12,,"Still image|Photographs|jpeg",40cincinnati01.jpg|169946290|https://digital.lib.uiowa.edu/,,,,,,,,,,,,,,,,,,,,,,,,,,,,,,,,,,,,,,,,,,,,,,,,"<a href=""https://digital.lib.uiowa.edu/"" target=""_blank"">View this item in its source respository</a>",,,,,,,,,,,,,,,,,,,,,,,,,,,,,https://www.iowaheritage.org/files/original/702e4614c6ab6d1a909c98a4cda0c335.jpg,"Remote Item","John P. Vander Maas Railroadiana",1,0
