 




﻿"Item Id","Item URI","Dublin Core:Title","Dublin Core:Subject","Dublin Core:Description","Dublin Core:Creator","Dublin Core:Source","Dublin Core:Publisher","Dublin Core:Date","Dublin Core:Contributor","Dublin Core:Rights","Dublin Core:Relation","Dublin Core:Format","Dublin Core:Language","Dublin Core:Type","Dublin Core:Identifier","Dublin Core:Coverage","Item Type Metadata:Text","Item Type Metadata:Interviewer","Item Type Metadata:Interviewee","Item Type Metadata:Location","Item Type Metadata:Transcription","Item Type Metadata:Local URL","Item Type Metadata:Original Format","Item Type Metadata:Physical Dimensions","Item Type Metadata:Duration","Item Type Metadata:Compression","Item Type Metadata:Producer","Item Type Metadata:Director","Item Type Metadata:Bit Rate/Frequency","Item Type Metadata:Time Summary","Item Type Metadata:Email Body","Item Type Metadata:Subject Line","Item Type Metadata:From","Item Type Metadata:To","Item Type Metadata:CC","Item Type Metadata:BCC","Item Type Metadata:Number of Attachments","Item Type Metadata:Standards","Item Type Metadata:Objectives","Item Type Metadata:Materials","Item Type Metadata:Lesson Plan Text","Item Type Metadata:URL","Item Type Metadata:Event Type","Item Type Metadata:Participants","Item Type Metadata:Birth Date","Item Type Metadata:Birthplace","Item Type Metadata:Death Date","Item Type Metadata:Occupation","Item Type Metadata:Biographical Text","Item Type Metadata:Bibliography","Item Type Metadata:Digital Reproduction Information","Item Type Metadata:Repository","Item Type Metadata:Repository Collection","Item Type Metadata:Contact information.","Item Type Metadata:File Name","Item Type Metadata:Notes","Item Type Metadata:Digital item created","Item Type Metadata:Digital item modified","Item Type Metadata:Executive Orders","Item Type Metadata:Record Created","Item Type Metadata:Record Modified","Item Type Metadata:Transcription2","Item Type Metadata:Source URL","Omeka Legacy File:Additional Creator","Omeka Legacy File:Transcriber","Omeka Legacy File:Producer","Omeka Legacy File:Render Device","Omeka Legacy File:Render Details","Omeka Legacy File:Capture Date","Omeka Legacy File:Capture Device","Omeka Legacy File:Capture Details","Omeka Legacy File:Change History","Omeka Legacy File:Watermark","Omeka Legacy File:Encryption","Omeka Legacy File:Compression","Omeka Legacy File:Post Processing","Omeka Image File:Width","Omeka Image File:Height","Omeka Image File:Bit Depth","Omeka Image File:Channels","Omeka Image File:Exif String","Omeka Image File:Exif Array","Omeka Image File:IPTC String","Omeka Image File:IPTC Array","Omeka Video File:Bitrate","Omeka Video File:Duration","Omeka Video File:Sample Rate","Omeka Video File:Codec","Omeka Video File:Width","Omeka Video File:Height",tags,file,itemType,collection,public,featured
9986,https://www.iowaheritage.org/items/show/9986,"Ozaki Masutaro and construction worker at site of new pond levee, Shinkyo commune, Nara-ken, Japan, April 1965, April 1965","Men|Japanese|Ozaki, Masutaro|Shinkyo|Japan -- Nara-ken|1960-1970|People|Spiritual leaders|Civic leaders|Collective settlements|Collective farms|Smoking",,"Plath, David W.",,"University of Iowa. Libraries. University Archives",1965-04|2008-03-03,,"Educational use only, no other permissions given. U.S. and international copyright laws may protect this item. Commercial use or distribution of this digital object is not permitted without written permission of the University Archives at The University of Iowa Libraries.","Anthropology at Iowa Digital Collection|David Plath Japanese Fieldwork Collection|David Plath Papers|In process",,,"Still image|Photographs|jpeg",https://digital.lib.uiowa.edu/,,,,,,,,,,,,,,,,,,,,,,,,,,,,,,,,,,,,,,,,,,,,,,,,"<a href=""https://digital.lib.uiowa.edu/"" target=""_blank"">View this item in its source respository</a>",,,,,,,,,,,,,,,,,,,,,,,,,,,,,https://www.iowaheritage.org/files/original/4cc12e0766f3ee5924e4f6e1d26fc59f.jpg,"Remote Item","African American Women in Iowa Collection",1,0
9979,https://www.iowaheritage.org/items/show/9979,"Man unloading pallets in the tatami factory, Shinkyo commune, Nara-ken, Japan, April 1965","Men|Japanese|Shinkyo|Japan -- Nara-ken|1960-1970|People|Collective settlements|Textile industry|Textile mill workers|Collective farms",,"Plath, David W.",,"University of Iowa. Libraries. University Archives",1965-04|2008-03-03,,"Educational use only, no other permissions given. U.S. and international copyright laws may protect this item. Commercial use or distribution of this digital object is not permitted without written permission of the University Archives at The University of Iowa Libraries.","Anthropology at Iowa Digital Collection|David Plath Japanese Fieldwork Collection|David Plath Papers|In process",,,"Still image|Photographs|jpeg",https://digital.lib.uiowa.edu/,,,,,,,,,,,,,,,,,,,,,,,,,,,,,,,,,,,,,,,,,,,,,,,,"<a href=""https://digital.lib.uiowa.edu/"" target=""_blank"">View this item in its source respository</a>",,,,,,,,,,,,,,,,,,,,,,,,,,,,,https://www.iowaheritage.org/files/original/bb2ec1664c74ab6b38f5d1e4c3b148a2.jpg,"Remote Item","African American Women in Iowa Collection",1,0
9974,https://www.iowaheritage.org/items/show/9974,"Hand-binding the edges of a tatami mat, Shinkyo commune, Nara-ken, Japan, April 1965 (Left: Research Assistant Nonoyama Hisaya)","Men|Japanese|Shinkyo|Japan -- Nara-ken|1960-1970|People|Collective settlements|Collective farms|Textile industry|Textile mill workers",,"Plath, David W.",,"University of Iowa. Libraries. University Archives",1965-04|2008-03-03,,"Educational use only, no other permissions given. U.S. and international copyright laws may protect this item. Commercial use or distribution of this digital object is not permitted without written permission of the University Archives at The University of Iowa Libraries.","Anthropology at Iowa Digital Collection|David Plath Japanese Fieldwork Collection|David Plath Papers|In process",,,"Still image|Photographs|jpeg",https://digital.lib.uiowa.edu/,,,,,,,,,,,,,,,,,,,,,,,,,,,,,,,,,,,,,,,,,,,,,,,,"<a href=""https://digital.lib.uiowa.edu/"" target=""_blank"">View this item in its source respository</a>",,,,,,,,,,,,,,,,,,,,,,,,,,,,,https://www.iowaheritage.org/files/original/9ec2a44804af9fead5a83f2bf3e342cb.jpg,"Remote Item","African American Women in Iowa Collection",1,0
9972,https://www.iowaheritage.org/items/show/9972,"Cooks preparing meal, Shinkyo commune, Nara-ken, Japan, 1965","Men|Japanese|Shinkyo|Japan -- Nara-ken|1960-1970|Women|People|Cookery|Collective settlements|Collective farms",,"Plath, David W.",,"University of Iowa. Libraries. University Archives",1965-04|2008-03-03,,"Educational use only, no other permissions given. U.S. and international copyright laws may protect this item. Commercial use or distribution of this digital object is not permitted without written permission of the University Archives at The University of Iowa Libraries.","Anthropology at Iowa Digital Collection|David Plath Japanese Fieldwork Collection|David Plath Papers|In process",,,"Still image|Photographs|jpeg",https://digital.lib.uiowa.edu/,,,,,,,,,,,,,,,,,,,,,,,,,,,,,,,,,,,,,,,,,,,,,,,,"<a href=""https://digital.lib.uiowa.edu/"" target=""_blank"">View this item in its source respository</a>",,,,,,,,,,,,,,,,,,,,,,,,,,,,,https://www.iowaheritage.org/files/original/02ff93e5b61146f268e89101a67fad8c.jpg,"Remote Item","African American Women in Iowa Collection",1,0
9970,https://www.iowaheritage.org/items/show/9970,"Atarashiki Mura commune founder Mushanokoji Saneatsu, garden of his house, Tokyo, Japan, 1965","Men|Japanese|Mushanokoji, Saneatsu, 1885-1976|Atarashiki Mura|Japan -- Hyuga|1960-1970|People|Authors|Spiritual leaders|Civic leaders|Collective settlements|Collective farms",,"Plath, David W.",,"University of Iowa. Libraries. University Archives",1965|2008-03-03,,"Educational use only, no other permissions given. U.S. and international copyright laws may protect this item. Commercial use or distribution of this digital object is not permitted without written permission of the University Archives at The University of Iowa Libraries.","Anthropology at Iowa Digital Collection|David Plath Japanese Fieldwork Collection|David Plath Papers|In process",,,"Still image|Photographs|jpeg",AM01.jpg|https://digital.lib.uiowa.edu/,,,,,,,,,,,,,,,,,,,,,,,,,,,,,,,,,,,,,,,,,,,,,,,,"<a href=""https://digital.lib.uiowa.edu/"" target=""_blank"">View this item in its source respository</a>",,,,,,,,,,,,,,,,,,,,,,,,,,,,,https://www.iowaheritage.org/files/original/8425044eb0456d5fbae6c8186878a45c.jpg,"Remote Item","African American Women in Iowa Collection",1,0
9969,https://www.iowaheritage.org/items/show/9969,"Ferryman crossing stream to site of original Atarashiki Mura 2, Hyuga, Japan, 1965","Men|Japanese|Atarashiki Mura|Japan -- Hyuga|1960-1970|People|Ferries|Boatmen|Collective settlements|Collective farms","""To reach the original Atarashiki-mura in Hyuga one had to be ferried across a small stream. The boatman was, I think, a close friend of Mushanokoji in the founding era of A.M. in Taisho""--Notes from D. Plath.","Plath, David W.",,"University of Iowa. Libraries. University Archives",1965|2008-03-03,,"Educational use only, no other permissions given. U.S. and international copyright laws may protect this item. Commercial use or distribution of this digital object is not permitted without written permission of the University Archives at The University of Iowa Libraries.","Anthropology at Iowa Digital Collection|David Plath Japanese Fieldwork Collection|David Plath Papers|In process",,,"Still image|Photographs|jpeg",AM00.jpg|https://digital.lib.uiowa.edu/,,,,,,,,,,,,,,,,,,,,,,,,,,,,,,,,,,,,,,,,,,,,,,,,"<a href=""https://digital.lib.uiowa.edu/"" target=""_blank"">View this item in its source respository</a>",,,,,,,,,,,,,,,,,,,,,,,,,,,,,https://www.iowaheritage.org/files/original/7b4f23d3339161579580f0c7322149b8.jpg,"Remote Item","African American Women in Iowa Collection",1,0
9963,https://www.iowaheritage.org/items/show/9963,"Esther Walls' general correspondence, 1949","Universities & colleges|African Americans|Walls, Esther J., 1926-|State University of Iowa|United States -- Iowa -- Mason City|1940-1950|Students|Organizations|Fraternities & sororities|Men|Women|Alumni & alumnae|Banquets|Graduate students|Cousins, C. E.|Brown, S. Joe|Franklin Book Programs, inc.|New York Public Library. Countee Cullen Branch|New York Public Library|United States -- Iowa -- Iowa City|United States -- Iowa -- Des Moines|United States -- New York -- New York","Contents: Acceptance letter to State University of Iowa graduate college, Mar. 28, 1949; C.E. Cousins' letter (State University of Iowa), Aug. 2, 1949; S. Joe Brown's invitation to Founder's Day dinner, Nov. 12, 1949","Walls, Esther J., 1926-",,"University of Iowa. Iowa Women's Archives",1949|2007-09-12,,"Educational use only, no other permissions given. U.S. and international copyright laws may protect this item. Commercial use or distribution of this digital object is not permitted without written permission of the Iowa Women's Archives.","African American Women in Iowa Digital Collection|http://digital.lib.uiowa.edu/aaws/|Esther J. Walls papers, 1860s-1996|http://www.lib.uiowa.edu/collguides/?IWA0288|Correspondence: General, 1949|http://www.lib.uiowa.edu/iwa/Topical_holdings_lists/AAhold.html",jpeg,,Text|Correspondence,"IWA0288|Correspondence - General 1949|166295411|https://digital.lib.uiowa.edu/",,,,,,,,,,,,,,,,,,,,,,,,,,,,,,,,,,,,,,,,,,,,,,,,"<a href=""https://digital.lib.uiowa.edu/"" target=""_blank"">View this item in its source respository</a>",,,,,,,,,,,,,,,,,,,,,,,,,,,,,https://www.iowaheritage.org/files/original/3e65da579b8d0f5c88bc58a51bfc1100.jpg,"Remote Item","African American Women in Iowa Collection",1,0
9943,https://www.iowaheritage.org/items/show/9943,"Hawkeye 1953 [excerpt]","Universities & colleges|African Americans|University of Iowa|United States -- Iowa -- Iowa City|1950-1960|Students|Women|Men|Student organizations",,"Student Publications, Inc.",,"University of Iowa. Libraries. University Archives",1953|2008-01-17,,"Educational use only, no other permissions given. U.S. and international copyright laws may protect this digital object. Commercial use or distribution of the object is not permitted without prior permission of the copyright holder.","African American Women in Iowa Digital Collection; African American Women Students at the University of Iowa, 1910-1960|http://digital.lib.uiowa.edu/aaws/|Yearbooks and Student Newspapers|http://www.lib.uiowa.edu/spec-coll/archives/faq/faqyearbooks.htm",jpeg|28|22,,"Text; Still image|Yearbooks",RG02.10|166295411|https://digital.lib.uiowa.edu/,,,,,,,,,,,,,,,,,,,,,,,,,,,,,,,,,,,,,,,,,,,,,,,,"<a href=""https://digital.lib.uiowa.edu/"" target=""_blank"">View this item in its source respository</a>",,,,,,,,,,,,,,,,,,,,,,,,,,,,,https://www.iowaheritage.org/files/original/449b82b4b1ff175daa06d531b7246cc1.jpg,"Remote Item","African American Women in Iowa Collection",1,0
9837,https://www.iowaheritage.org/items/show/9837,"Hawkeye 1950 [excerpt]","Universities & colleges|African Americans|University of Iowa|United States -- Iowa -- Iowa City|1950-1960|Students|Women|Men|Student organizations",,"Student Publications, Inc.",,"University of Iowa. Libraries. University Archives",1950|2007-10-29,,"Educational use only, no other permissions given. U.S. and international copyright laws may protect this digital object. Commercial use or distribution of the object is not permitted without prior permission of the copyright holder.","African American Women in Iowa Digital Collection; African American Women Students at the University of Iowa, 1910-1960|http://digital.lib.uiowa.edu/aaws/|Yearbooks and Student Newspapers|http://www.lib.uiowa.edu/spec-coll/archives/faq/faqyearbooks.htm",jpeg|28|22,,"Text; Still image|Yearbooks",RG02.10|166295411|https://digital.lib.uiowa.edu/,,,,,,,,,,,,,,,,,,,,,,,,,,,,,,,,,,,,,,,,,,,,,,,,"<a href=""https://digital.lib.uiowa.edu/"" target=""_blank"">View this item in its source respository</a>",,,,,,,,,,,,,,,,,,,,,,,,,,,,,https://www.iowaheritage.org/files/original/d45bb45a95fa5a501936678162dacfb8.jpg,"Remote Item","African American Women in Iowa Collection",1,0
9836,https://www.iowaheritage.org/items/show/9836,"Hawkeye 1956 [excerpt]","Universities & colleges|African Americans|University of Iowa|United States -- Iowa -- Iowa City|1950-1960|Students|Women|Men|Student organizations",,"Student Publications, Inc.",,"University of Iowa. Libraries. University Archives",1956|2007-10-29,,"Educational use only, no other permissions given. U.S. and international copyright laws may protect this digital object. Commercial use or distribution of the object is not permitted without prior permission of the copyright holder.","African American Women in Iowa Digital Collection; African American Women Students at the University of Iowa, 1910-1960|http://digital.lib.uiowa.edu/aaws/|Yearbooks and Student Newspapers|http://www.lib.uiowa.edu/spec-coll/archives/faq/faqyearbooks.htm",jpeg|28|22,,"Text; Still image|Yearbooks",RG02.10|166295411|https://digital.lib.uiowa.edu/,,,,,,,,,,,,,,,,,,,,,,,,,,,,,,,,,,,,,,,,,,,,,,,,"<a href=""https://digital.lib.uiowa.edu/"" target=""_blank"">View this item in its source respository</a>",,,,,,,,,,,,,,,,,,,,,,,,,,,,,https://www.iowaheritage.org/files/original/4b3eeb4b5fa8ddeac5e84ce790b07043.jpg,"Remote Item","African American Women in Iowa Collection",1,0
