 




﻿"Item Id","Item URI","Dublin Core:Title","Dublin Core:Subject","Dublin Core:Description","Dublin Core:Creator","Dublin Core:Source","Dublin Core:Publisher","Dublin Core:Date","Dublin Core:Contributor","Dublin Core:Rights","Dublin Core:Relation","Dublin Core:Format","Dublin Core:Language","Dublin Core:Type","Dublin Core:Identifier","Dublin Core:Coverage","Item Type Metadata:Text","Item Type Metadata:Interviewer","Item Type Metadata:Interviewee","Item Type Metadata:Location","Item Type Metadata:Transcription","Item Type Metadata:Local URL","Item Type Metadata:Original Format","Item Type Metadata:Physical Dimensions","Item Type Metadata:Duration","Item Type Metadata:Compression","Item Type Metadata:Producer","Item Type Metadata:Director","Item Type Metadata:Bit Rate/Frequency","Item Type Metadata:Time Summary","Item Type Metadata:Email Body","Item Type Metadata:Subject Line","Item Type Metadata:From","Item Type Metadata:To","Item Type Metadata:CC","Item Type Metadata:BCC","Item Type Metadata:Number of Attachments","Item Type Metadata:Standards","Item Type Metadata:Objectives","Item Type Metadata:Materials","Item Type Metadata:Lesson Plan Text","Item Type Metadata:URL","Item Type Metadata:Event Type","Item Type Metadata:Participants","Item Type Metadata:Birth Date","Item Type Metadata:Birthplace","Item Type Metadata:Death Date","Item Type Metadata:Occupation","Item Type Metadata:Biographical Text","Item Type Metadata:Bibliography","Item Type Metadata:Digital Reproduction Information","Item Type Metadata:Repository","Item Type Metadata:Repository Collection","Item Type Metadata:Contact information.","Item Type Metadata:File Name","Item Type Metadata:Notes","Item Type Metadata:Digital item created","Item Type Metadata:Digital item modified","Item Type Metadata:Executive Orders","Item Type Metadata:Record Created","Item Type Metadata:Record Modified","Item Type Metadata:Transcription2","Item Type Metadata:Source URL","Omeka Legacy File:Additional Creator","Omeka Legacy File:Transcriber","Omeka Legacy File:Producer","Omeka Legacy File:Render Device","Omeka Legacy File:Render Details","Omeka Legacy File:Capture Date","Omeka Legacy File:Capture Device","Omeka Legacy File:Capture Details","Omeka Legacy File:Change History","Omeka Legacy File:Watermark","Omeka Legacy File:Encryption","Omeka Legacy File:Compression","Omeka Legacy File:Post Processing","Omeka Image File:Width","Omeka Image File:Height","Omeka Image File:Bit Depth","Omeka Image File:Channels","Omeka Image File:Exif String","Omeka Image File:Exif Array","Omeka Image File:IPTC String","Omeka Image File:IPTC Array","Omeka Video File:Bitrate","Omeka Video File:Duration","Omeka Video File:Sample Rate","Omeka Video File:Codec","Omeka Video File:Width","Omeka Video File:Height",tags,file,itemType,collection,public,featured
98456,https://www.iowaheritage.org/items/show/98456,"Soil Conservation Service staff","Jackson County Soil and Water Conservation District|Soil Conservation Service","B&W photograph of eight men posing for a photograph. Unidentified men are SCS staff.","Jackson County Soil and Water Conservation District ",,"State Library of Iowa",Unknown,"Jackson County Soil and Water Conservation District. For questions about copyright, contact the State Library of Iowa at  <a href=""http://www.statelibraryofiowa.org"">http://www.statelibraryofiowa.org</a>.","This item is protected by copyright and/or related rights. Your are free to use this Item in any way that is permitted by the copyright and related rights legislation that applies to your use. For other uses you need to obtain permission from the rights-holder(s). <a href=""http://rightsstatements.org/"">http://rightsstatements.org</a>",,pdf,eng,"Still Image; Photograph",,,,,,,,,,,,,,,,,,,,,,,,,,,,,,,,,,,,,,,,,Jackson_SCS_Area_4_Personnel_20191213_001.jpg,,,,,,,,,,,,,,,,,,,,,,,,,,,,,,,,,,,,"Jackson County Soil and Water Conservation District,Soil Conservation Service",https://www.iowaheritage.org/files/original/53843f546bc04278bf3665cc6198db69.pdf,"Still Image","Jackson County Soil and Water Conservation District Historic Collection",1,0
99253,https://www.iowaheritage.org/items/show/99253,"Soil Conservation Board, 1965","Jackson County Soil and Water Conservation District|Commissioners|Soil Conservation Board","B&W photograph of SWCD board: Harold Wolms, Donald Kilburg, John Henderson, Frank Weiland, Lorrain Gray, and Cathy Hartvigsen.","Jackson County Soil and Water Conservation District ",,"State Library of Iowa",1965-01,"Jackson County Soil and Water Conservation District of Iowa. For questions about copyright, contact the State Library of Iowa at  <a href=""http://www.statelibraryofiowa.org"">http://www.statelibraryofiowa.org</a>.","This item is protected by copyright and/or related rights. Your are free to use this Item in any way that is permitted by the copyright and related rights legislation that applies to your use. For other uses you need to obtain permission from the rights-holder(s). <a href=""http://rightsstatements.org/"">http://rightsstatements.org</a>",,jpg,,"Still Image; Photograph",,,,,,,,,,,,,,,,,,,,,,,,,,,,,,,,,,,,,,,,,Jackson_1966_H_Wolms_D_Kilburg_J_Henderson_F_weiland_L_Gray_20191218_001|Jackson_1966_H_Wolms_D_Kilburg_J_Henderson_F_weiland_L_Gray_20191218_002,,,,,,,,,,,,,,,,,,,,,,,,,,,,,,,,,,,,"Cathy Hartvigsen,Commissioners,Donald Kilburg,Frank Weiland,Harold Wolms,Jackson County Soil and Water Conservation District,John Henderson,Lorrain Gray,Soil Conservation Board","https://www.iowaheritage.org/files/original/6cf4b3d9aa41d2ea1da480252b705371.jpg,https://www.iowaheritage.org/files/original/f72a3bd27f787e247a516059382510f5.jpg","Still Image","Jackson County Soil and Water Conservation District Historic Collection",1,0
99260,https://www.iowaheritage.org/items/show/99260,"Soil Conservation Award winner, Floyd Peters and family, 1967","Jackson County Soil and Water Conservation District|Soil Conservation Achievement Award|Floyd Peters","B&W photograph of Soil Conservation Achievement award winner, Floyd Peters with his wife, daughter and son. Also featured: Harold Sullivan, Mr. Henderson, and Cathie Hartvigsen.","Jackson County Soil and Water Conservation District ",,"State Library of Iowa",1967,"Jackson County Soil and Water Conservation District of Iowa. For questions about copyright, contact the State Library of Iowa at  <a href=""http://www.statelibraryofiowa.org"">http://www.statelibraryofiowa.org</a>.","This item is protected by copyright and/or related rights. Your are free to use this Item in any way that is permitted by the copyright and related rights legislation that applies to your use. For other uses you need to obtain permission from the rights-holder(s). <a href=""http://rightsstatements.org/"">http://rightsstatements.org</a>",,jpg,,"Still Image; Photograph",,,,,,,,,,,,,,,,,,,,,,,,,,,,,,,,,,,,,,,,,Jackson_1967_Conservation_Award_Winners_Floyd_Peters_&_Family_20191218_001|Jackson_1967_Conservation_Award_Winners_Floyd_Peters_&_Family_20191218_002,,,,,,,,,,,,,,,,,,,,,,,,,,,,,,,,,,,,"Cathie Hartvigsen.,Floyd Peters,Harold Sullivan,Jackson County Soil and Water Conservation District,Mr. Henderson,Soil Conservation Achievement Award","https://www.iowaheritage.org/files/original/9aab564facdcbb272993f4402d62c888.jpg,https://www.iowaheritage.org/files/original/4767f1de4fe648b5ec9d37c6b9c09cb4.jpg","Still Image","Jackson County Soil and Water Conservation District Historic Collection",1,0
100262,https://www.iowaheritage.org/items/show/100262,"Smith Creek","Jackson County Soil and Water Conservation District","Color images of Smith Creek. ","Jackson County Soil and Water Conservation District",,"State Library of Iowa",Unknown,"Jackson County Soil and Water Conservation District of Iowa. For questions about copyright, contact the State Library of Iowa at  <a href=""http://www.statelibraryofiowa.org"">http://www.statelibraryofiowa.org</a>.","This item is protected by copyright and/or related rights. Your are free to use this Item in any way that is permitted by the copyright and related rights legislation that applies to your use. For other uses you need to obtain permission from the rights-holder(s). <a href=""http://rightsstatements.org/"">http://rightsstatements.org</a>",,jpg,,"Still Image; Photograph",,,,,,,,,,,,,,,,,,,,,,,,,,,,,,,,,,,,,,,,,Jackson_SWCD_Geo_Gravert_058|Jackson_SWCD_Geo_Gravert_059|Jackson_SWCD_Geo_Gravert_060,,,,,,,,,,,,,,,,,,,,,,,,,,,,,,,,,,,,"George Gravert,Jackson County Soil and Water Conservation District,Smith Creek","https://www.iowaheritage.org/files/original/ca2720118d56054d83a9b28b73da3592.jpg,https://www.iowaheritage.org/files/original/15fac94e88163cab93f64b356feccf1f.jpg,https://www.iowaheritage.org/files/original/d83e086d78fb44354e52a2c0be5c4dc7.jpg","Still Image","Jackson County Soil and Water Conservation District Historic Collection",1,0
98329,https://www.iowaheritage.org/items/show/98329,"Sixth grade students on Werden farm, 1971","Jackson County Soil and Water Conservation District|Werden Farm|Conservation Education","B&W photograph of sixth grade students on Werden farm.","Jackson County Soil and Water Conservation District ",,"State Library of Iowa",1971,"Jackson County Soil and Water Conservation District. For questions about copyright, contact the State Library of Iowa at  <a href=""http://www.statelibraryofiowa.org"">http://www.statelibraryofiowa.org</a>.","This item is protected by copyright and/or related rights. Your are free to use this Item in any way that is permitted by the copyright and related rights legislation that applies to your use. For other uses you need to obtain permission from the rights-holder(s). <a href=""http://rightsstatements.org/"">http://rightsstatements.org</a>",,pdf,eng,"Still Image; Photograph",,,,,,,,,,,,,,,,,,,,,,,,,,,,,,,,,,,,,,,,,Jackson_1971_6th_Grade_Werden_Farm_20191212_001,,,,,,,,,,,,,,,,,,,,,,,,,,,,,,,,,,,,"Conservation Education,Jackson County Soil and Water Conservation District,Students,Werden Farm",https://www.iowaheritage.org/files/original/bdcb2dd71ec257c06f5204ddb3ad8c60.pdf,"Still Image","Jackson County Soil and Water Conservation District Historic Collection",1,0
98325,https://www.iowaheritage.org/items/show/98325,"Six row cultivator, 1969","Jackson County Soil and Water Conservation District|Six Row Cultivator","B&W photograph of a six row cultivator in corn field.","Jackson County Soil and Water Conservation District ",,"State Library of Iowa",1969,"Jackson County Soil and Water Conservation District. For questions about copyright, contact the State Library of Iowa at  <a href=""http://www.statelibraryofiowa.org"">http://www.statelibraryofiowa.org</a>.","This item is protected by copyright and/or related rights. Your are free to use this Item in any way that is permitted by the copyright and related rights legislation that applies to your use. For other uses you need to obtain permission from the rights-holder(s). <a href=""http://rightsstatements.org/"">http://rightsstatements.org</a>",,pdf,eng,"Still Image; Photograph",,,,,,,,,,,,,,,,,,,,,,,,,,,,,,,,,,,,,,,,,Jackson_1969_6_Row_Cultivator_20191213_001.jpg,,,,,,,,,,,,,,,,,,,,,,,,,,,,,,,,,,,,"Agriculture,Corn,Jackson County Soil and Water Conservation District,Six Row Cultivator",https://www.iowaheritage.org/files/original/3933d3f210d3d8353d6cd876ba0aeaf3.pdf,"Still Image","Jackson County Soil and Water Conservation District Historic Collection",1,0
98398,https://www.iowaheritage.org/items/show/98398,"Silt deposit on George Beck Sr. cropland, 1968","Jackson County Soil and Water Conservation District|Beck, George|Soil Erosion","B&W photograph of silt deposit on George Beck Sr. field.","Jackson County Soil and Water Conservation District ",,"State Library of Iowa",1968-06,"Jackson County Soil and Water Conservation District. For questions about copyright, contact the State Library of Iowa at  <a href=""http://www.statelibraryofiowa.org"">http://www.statelibraryofiowa.org</a>.","This item is protected by copyright and/or related rights. Your are free to use this Item in any way that is permitted by the copyright and related rights legislation that applies to your use. For other uses you need to obtain permission from the rights-holder(s). <a href=""http://rightsstatements.org/"">http://rightsstatements.org</a>",,pdf,eng,"Still Image; Photograph",,,,,,,,,,,,,,,,,,,,,,,,,,,,,,,,,,,,,,,,,Jackson_George_Beck_Sr_1968_20191212_10213886.jpg,,,,,,,,,,,,,,,,,,,,,,,,,,,,,,,,,,,,"George Beck Sr.,Jackson County Soil and Water Conservation District,Silt Deposit,Soil Erosion",https://www.iowaheritage.org/files/original/9cc691ab151d89efff97fea657e860a1.pdf,"Still Image","Jackson County Soil and Water Conservation District Historic Collection",1,0
98296,https://www.iowaheritage.org/items/show/98296,"Silt deposit from S. Fork of Maquoketa River, 1964","Jackson County Soil and Water Conservation District|Maquoketa River|Silt","B&W photograph of Silt deposit from S. Fork of Maquoketa River.","Jackson County Soil and Water Conservation District ",,"State Library of Iowa",1964,"Jackson County Soil and Water Conservation District. For questions about copyright, contact the State Library of Iowa at  <a href=""http://www.statelibraryofiowa.org"">http://www.statelibraryofiowa.org</a>.","This item is protected by copyright and/or related rights. Your are free to use this Item in any way that is permitted by the copyright and related rights legislation that applies to your use. For other uses you need to obtain permission from the rights-holder(s). <a href=""http://rightsstatements.org/"">http://rightsstatements.org</a>",,pdf,eng,"Still Image; Photograph",,,,,,,,,,,,,,,,,,,,,,,,,,,,,,,,,,,,,,,,,Jackson_1964_Silt_Deposit_From_S_Fork_Azetto_Clark_20191212_001.jpg,,,,,,,,,,,,,,,,,,,,,,,,,,,,,,,,,,,,"Jackson County Soil and Water Conservation District,Maquoketa River,Silt",https://www.iowaheritage.org/files/original/77050254c998cb4cda9f560b713a04ba.pdf,"Still Image","Jackson County Soil and Water Conservation District Historic Collection",1,0
98209,https://www.iowaheritage.org/items/show/98209,"Silos and farm structures","Jackson County Soil and Water Conservation District|Bevan, Bill","Color aerial photograph of silos and farm structures on Bill Bevan's farm.","Jackson County Soil and Water Conservation District ",,"State Library of Iowa",Unknown,"Jackson County Soil and Water Conservation District. For questions about copyright, contact the State Library of Iowa at  <a href=""http://www.statelibraryofiowa.org"">http://www.statelibraryofiowa.org</a>.","This item is protected by copyright and/or related rights. Your are free to use this Item in any way that is permitted by the copyright and related rights legislation that applies to your use. For other uses you need to obtain permission from the rights-holder(s). <a href=""http://rightsstatements.org/"">http://rightsstatements.org</a>",,jpg,eng,"Still Image; Photograph",,,,,,,,,,,,,,,,,,,,,,,,,,,,,,,,,,,,,,,,,Bill_Bevan_,,,,,,,,,,,,,,,,,,,,,,,,,,,,,,,,,,,,"Agricultural Land,Bill Bevan,Jackson County Soil and Water Conservation District",https://www.iowaheritage.org/files/original/ad0ca6ced92e69ca465669d8199fdd37.pdf,"Still Image","Jackson County Soil and Water Conservation District Historic Collection",1,0
98271,https://www.iowaheritage.org/items/show/98271,"Shaping a waterway on Bill Goetler farm, 1968","Jackson County Soil and Water Conservation District|Waterway|Goetler, Bill","B&W photographs of shaping waterway on Bill Goetler farm.","Jackson County Soil and Water Conservation District ",,"State Library of Iowa",1968-08,"Jackson County Soil and Water Conservation District. For questions about copyright, contact the State Library of Iowa at  <a href=""http://www.statelibraryofiowa.org"">http://www.statelibraryofiowa.org</a>.","This item is protected by copyright and/or related rights. Your are free to use this Item in any way that is permitted by the copyright and related rights legislation that applies to your use. For other uses you need to obtain permission from the rights-holder(s). <a href=""http://rightsstatements.org/"">http://rightsstatements.org</a>",,pdf,eng,"Still Image; Photograph",,,,,,,,,,,,,,,,,,,,,,,,,,,,,,,,,,,,,,,,,Jackson_8_1968_Waterway_Bill_Goetler_Farm_2019,,,,,,,,,,,,,,,,,,,,,,,,,,,,,,,,,,,,"Bill Goetler,Jackson County Soil and Water Conservation District,Waterway",https://www.iowaheritage.org/files/original/2be16dc50026bb6a80773a3328f5e79c.pdf,"Still Image","Jackson County Soil and Water Conservation District Historic Collection",1,0
