 




﻿"Item Id","Item URI","Dublin Core:Title","Dublin Core:Subject","Dublin Core:Description","Dublin Core:Creator","Dublin Core:Source","Dublin Core:Publisher","Dublin Core:Date","Dublin Core:Contributor","Dublin Core:Rights","Dublin Core:Relation","Dublin Core:Format","Dublin Core:Language","Dublin Core:Type","Dublin Core:Identifier","Dublin Core:Coverage","Item Type Metadata:Text","Item Type Metadata:Interviewer","Item Type Metadata:Interviewee","Item Type Metadata:Location","Item Type Metadata:Transcription","Item Type Metadata:Local URL","Item Type Metadata:Original Format","Item Type Metadata:Physical Dimensions","Item Type Metadata:Duration","Item Type Metadata:Compression","Item Type Metadata:Producer","Item Type Metadata:Director","Item Type Metadata:Bit Rate/Frequency","Item Type Metadata:Time Summary","Item Type Metadata:Email Body","Item Type Metadata:Subject Line","Item Type Metadata:From","Item Type Metadata:To","Item Type Metadata:CC","Item Type Metadata:BCC","Item Type Metadata:Number of Attachments","Item Type Metadata:Standards","Item Type Metadata:Objectives","Item Type Metadata:Materials","Item Type Metadata:Lesson Plan Text","Item Type Metadata:URL","Item Type Metadata:Event Type","Item Type Metadata:Participants","Item Type Metadata:Birth Date","Item Type Metadata:Birthplace","Item Type Metadata:Death Date","Item Type Metadata:Occupation","Item Type Metadata:Biographical Text","Item Type Metadata:Bibliography","Item Type Metadata:Digital Reproduction Information","Item Type Metadata:Repository","Item Type Metadata:Repository Collection","Item Type Metadata:Contact information.","Item Type Metadata:File Name","Item Type Metadata:Notes","Item Type Metadata:Digital item created","Item Type Metadata:Digital item modified","Item Type Metadata:Executive Orders","Item Type Metadata:Record Created","Item Type Metadata:Record Modified","Item Type Metadata:Transcription2","Item Type Metadata:Source URL","Omeka Legacy File:Additional Creator","Omeka Legacy File:Transcriber","Omeka Legacy File:Producer","Omeka Legacy File:Render Device","Omeka Legacy File:Render Details","Omeka Legacy File:Capture Date","Omeka Legacy File:Capture Device","Omeka Legacy File:Capture Details","Omeka Legacy File:Change History","Omeka Legacy File:Watermark","Omeka Legacy File:Encryption","Omeka Legacy File:Compression","Omeka Legacy File:Post Processing","Omeka Image File:Width","Omeka Image File:Height","Omeka Image File:Bit Depth","Omeka Image File:Channels","Omeka Image File:Exif String","Omeka Image File:Exif Array","Omeka Image File:IPTC String","Omeka Image File:IPTC Array","Omeka Video File:Bitrate","Omeka Video File:Duration","Omeka Video File:Sample Rate","Omeka Video File:Codec","Omeka Video File:Width","Omeka Video File:Height",tags,file,itemType,collection,public,featured
30998,https://www.iowaheritage.org/items/show/30998,"Scottish Highlanders drum major and drummers, The University of Iowa, 1979","Universities & colleges|Tartans|University of Iowa|United States -- Iowa -- Iowa City|1970-1980|Bands|Kilts|Drums|Drum majors|Drummers (Musicians)|University of Iowa. Scottish Highlanders|Old Capitol (Iowa City, Iowa)","Dating back to 1936, the Scottish Highlanders was a student group dedicated to practicing and performing the Scottish arts of piping, drumming and dancing.","Kent, Frederick W. (Frederick Wallace), 1894-1984",,"University of Iowa. Libraries. University Archives",1979|2010-09-12,,"Educational use only, no other permissions given. U.S. and international copyright laws may protect this digital object. Commercial use or distribution of the object is not permitted without prior permission of the copyright holder.","Iowa City Town and Campus Scenes|Frederick W. Kent Collection of Photographs, 1866-2000|http://www.lib.uiowa.edu/collguides/?RG30.0001.01|Prints|Organizations|Scottish Highlanders|Scottish Highlanders|Scanned with Ricoh Aficio 3228C @ 600 ppi. Master image saved in TIFF format",3|3,,"Still image|Photographs; Group portraits|jpeg",RG30.0001.01|index.cpd|https://digital.lib.uiowa.edu/,,,,,,,,,,,,,,,,,,,,,,,,,,,,,,,,,,,,,,,,,,,,,,,,"<a href=""https://digital.lib.uiowa.edu/"" target=""_blank"">View this item in its source respository</a>",,,,,,,,,,,,,,,,,,,,,,,,,,,,,https://www.iowaheritage.org/files/original/00cfdbc611e784533a749f5f467cb368.jpg,"Remote Item","Iowa City Town and Campus Scenes",1,0
31309,https://www.iowaheritage.org/items/show/31309,"Scottish Highlanders at Iowa Field, The University of Iowa, 1930s","Universities & colleges|Tartans|University of Iowa|United States -- Iowa -- Iowa City|1930-1940|Kilts|Marching bands|Athletic fields|Bleachers|Spectators|Drums|University of Iowa. Scottish Highlanders|Kinnick Stadium (Iowa City, Iowa)","Dating back to 1936, the Scottish Highlanders was a student group dedicated to practicing and performing the Scottish arts of piping, drumming and dancing.  Iowa Field was later renamed Kinnick Stadium.","Kent, Frederick W. (Frederick Wallace), 1894-1984",,"University of Iowa. Libraries. University Archives",1930/1939|2010-09-12,,"Educational use only, no other permissions given. U.S. and international copyright laws may protect this digital object. Commercial use or distribution of the object is not permitted without prior permission of the copyright holder.","Iowa City Town and Campus Scenes|Frederick W. Kent Collection of Photographs, 1866-2000|http://www.lib.uiowa.edu/collguides/?RG30.0001.01|Prints|Organizations|Scottish Highlanders|Scottish Highlanders|Scanned with Ricoh Aficio 3228C @ 600 ppi. Master image saved in TIFF format",,,"Still image|Photographs|jpeg",RG30.0001.01|org14-0025.jpg|https://digital.lib.uiowa.edu/,,,,,,,,,,,,,,,,,,,,,,,,,,,,,,,,,,,,,,,,,,,,,,,,"<a href=""https://digital.lib.uiowa.edu/"" target=""_blank"">View this item in its source respository</a>",,,,,,,,,,,,,,,,,,,,,,,,,,,,,https://www.iowaheritage.org/files/original/1cdf71486fb7e7f2e265be175c3f7305.jpg,"Remote Item","Iowa City Town and Campus Scenes",1,0
30891,https://www.iowaheritage.org/items/show/30891,"Scottish Highlanders at Iowa City Public Library, The University of Iowa, March 23, 1974","Universities & colleges|Tartans|Reisener, Pat|University of Iowa|United States -- Iowa -- Iowa City|1970-1980|Bands|Kilts|Drums|Bagpipes|Musicians|Concerts|Children|Libraries|Aspengren, Kate|Putnam, Terri|University of Iowa. Scottish Highlanders|Iowa City Public Library","Pipers: Pat Reisener and Kate Aspengren. Drummer: Terri Putnam. Dating back to 1936, the Scottish Highlanders was a student group dedicated to practicing and performing the Scottish arts of piping, drumming and dancing.","Kent, Frederick W. (Frederick Wallace), 1894-1984",,"University of Iowa. Libraries. University Archives",1974-03-23|2010-09-12,,"Educational use only, no other permissions given. U.S. and international copyright laws may protect this digital object. Commercial use or distribution of the object is not permitted without prior permission of the copyright holder.","Iowa City Town and Campus Scenes|Frederick W. Kent Collection of Photographs, 1866-2000|http://www.lib.uiowa.edu/collguides/?RG30.0001.01|Prints|Organizations|Scottish Highlanders|Scottish Highlanders|Scanned with Ricoh Aficio 3228C @ 600 ppi. Master image saved in TIFF format",8|10,,"Still image|Photographs|jpeg",RG30.0001.01|index.cpd|https://digital.lib.uiowa.edu/,,,,,,,,,,,,,,,,,,,,,,,,,,,,,,,,,,,,,,,,,,,,,,,,"<a href=""https://digital.lib.uiowa.edu/"" target=""_blank"">View this item in its source respository</a>",,,,,,,,,,,,,,,,,,,,,,,,,,,,,https://www.iowaheritage.org/files/original/437620ec908337c5dfdf850f0f101a60.jpg,"Remote Item","Iowa City Town and Campus Scenes",1,0
31434,https://www.iowaheritage.org/items/show/31434,"Scottish Highlanders  posing with drum, The University of Iowa, 1960s","Universities & colleges|Tartans|University of Iowa|United States -- Iowa -- Iowa City|1960-1970|Kilts|Marching bands|Women|Drums|University of Iowa. Scottish Highlanders","Dating back to 1936, the Scottish Highlanders was a student group dedicated to practicing and performing the Scottish arts of piping, drumming and dancing.","Kent, Frederick W. (Frederick Wallace), 1894-1984",,"University of Iowa. Libraries. University Archives",1960/1969|2010-09-12,,"Educational use only, no other permissions given. U.S. and international copyright laws may protect this digital object. Commercial use or distribution of the object is not permitted without prior permission of the copyright holder.","Iowa City Town and Campus Scenes|Frederick W. Kent Collection of Photographs, 1866-2000|http://www.lib.uiowa.edu/collguides/?RG30.0001.01|Prints|Organizations|Scottish Highlanders|Scottish Highlanders|Scanned with Ricoh Aficio 3228C @ 600 ppi. Master image saved in TIFF format",,,"Still image|Photographs|jpeg",RG30.0001.01|org16-0102.jpg|https://digital.lib.uiowa.edu/,,,,,,,,,,,,,,,,,,,,,,,,,,,,,,,,,,,,,,,,,,,,,,,,"<a href=""https://digital.lib.uiowa.edu/"" target=""_blank"">View this item in its source respository</a>",,,,,,,,,,,,,,,,,,,,,,,,,,,,,https://www.iowaheritage.org/files/original/717c43d0f8b8aa7e9f2cce543b06bf88.jpg,"Remote Item","Iowa City Town and Campus Scenes",1,0
31406,https://www.iowaheritage.org/items/show/31406,"Scottish Highlander with bouquet of flowers standing by train, Santa Fe, New Mexico, 1950s","Universities & colleges|Tartans|University of Iowa|United States -- New Mexico -- Santa Fe|1950-1960|Kilts|Band uniforms|Railroads|Bouquets|Flowers|Drums|University of Iowa. Scottish Highlanders","Dating back to 1936, the Scottish Highlanders was a student group dedicated to practicing and performing the Scottish arts of piping, drumming and dancing.","Kent, Frederick W. (Frederick Wallace), 1894-1984",,"University of Iowa. Libraries. University Archives",1950/1959|2010-09-12,,"Educational use only, no other permissions given. U.S. and international copyright laws may protect this digital object. Commercial use or distribution of the object is not permitted without prior permission of the copyright holder.","Iowa City Town and Campus Scenes|Frederick W. Kent Collection of Photographs, 1866-2000|http://www.lib.uiowa.edu/collguides/?RG30.0001.01|Prints|Organizations|Scottish Highlanders|Scottish Highlanders|Scanned with Ricoh Aficio 3228C @ 600 ppi. Master image saved in TIFF format",,,"Still image|Photographs|jpeg",RG30.0001.01|org16-0051.jpg|https://digital.lib.uiowa.edu/,,,,,,,,,,,,,,,,,,,,,,,,,,,,,,,,,,,,,,,,,,,,,,,,"<a href=""https://digital.lib.uiowa.edu/"" target=""_blank"">View this item in its source respository</a>",,,,,,,,,,,,,,,,,,,,,,,,,,,,,https://www.iowaheritage.org/files/original/c2c88f43d367ecc5ac54afa135e1a2de.jpg,"Remote Item","Iowa City Town and Campus Scenes",1,0
30863,https://www.iowaheritage.org/items/show/30863,"Scottish Highlander leader Carolyn Rabe, The University of Iowa, 1962","Universities & colleges|Rabe, Carolyn|University of Iowa|United States -- Iowa -- Iowa City|1960-1970|Drum majors|Band uniforms|Drums|University of Iowa. Scottish Highlanders","Dating back to 1936, the Scottish Highlanders was a student group dedicated to practicing and performing the Scottish arts of piping, drumming and dancing.","Kent, Frederick W. (Frederick Wallace), 1894-1984",,"University of Iowa. Libraries. University Archives",1962|2010-09-12,,"Educational use only, no other permissions given. U.S. and international copyright laws may protect this digital object. Commercial use or distribution of the object is not permitted without prior permission of the copyright holder.","Iowa City Town and Campus Scenes|Frederick W. Kent Collection of Photographs, 1866-2000|http://www.lib.uiowa.edu/collguides/?RG30.0001.01|Prints|Organizations|Scottish Highlanders|Scottish Highlanders|Scanned with Ricoh Aficio 3228C @ 600 ppi. Master image saved in TIFF format",10|8,,"Still image|Photographs|jpeg",RG30.0001.01|index.cpd|https://digital.lib.uiowa.edu/,,,,,,,,,,,,,,,,,,,,,,,,,,,,,,,,,,,,,,,,,,,,,,,,"<a href=""https://digital.lib.uiowa.edu/"" target=""_blank"">View this item in its source respository</a>",,,,,,,,,,,,,,,,,,,,,,,,,,,,,https://www.iowaheritage.org/files/original/29f7d675557bf050a0a45cef099535f2.jpg,"Remote Item","Iowa City Town and Campus Scenes",1,0
30862,https://www.iowaheritage.org/items/show/30862,"Scottish Highlander leader Carolyn Rabe, The University of Iowa, 1962","Universities & colleges|Rabe, Carolyn|University of Iowa|United States -- Iowa -- Iowa City|1960-1970|Drum majors|Band uniforms|Drums|University of Iowa. Scottish Highlanders","Dating back to 1936, the Scottish Highlanders was a student group dedicated to practicing and performing the Scottish arts of piping, drumming and dancing.","Kent, Frederick W. (Frederick Wallace), 1894-1984",,"University of Iowa. Libraries. University Archives",1962|2010-09-12,,"Educational use only, no other permissions given. U.S. and international copyright laws may protect this digital object. Commercial use or distribution of the object is not permitted without prior permission of the copyright holder.","Iowa City Town and Campus Scenes|Frederick W. Kent Collection of Photographs, 1866-2000|http://www.lib.uiowa.edu/collguides/?RG30.0001.01|Prints|Organizations|Scottish Highlanders|Scottish Highlanders|Scanned with Ricoh Aficio 3228C @ 600 ppi. Master image saved in TIFF format",2|3,,"Still image|Photographs|jpeg",RG30.0001.01|index.cpd|https://digital.lib.uiowa.edu/,,,,,,,,,,,,,,,,,,,,,,,,,,,,,,,,,,,,,,,,,,,,,,,,"<a href=""https://digital.lib.uiowa.edu/"" target=""_blank"">View this item in its source respository</a>",,,,,,,,,,,,,,,,,,,,,,,,,,,,,https://www.iowaheritage.org/files/original/7c0bd01128f56585fd79003a4e4f7b46.jpg,"Remote Item","Iowa City Town and Campus Scenes",1,0
30861,https://www.iowaheritage.org/items/show/30861,"Scottish Highlander leader Carolyn Rabe, The University of Iowa, 1962","Universities & colleges|Rabe, Carolyn|University of Iowa|United States -- Iowa -- Iowa City|1960-1970|Drum majors|Band uniforms|Drums|University of Iowa. Scottish Highlanders","Dating back to 1936, the Scottish Highlanders was a student group dedicated to practicing and performing the Scottish arts of piping, drumming and dancing.","Kent, Frederick W. (Frederick Wallace), 1894-1984",,"University of Iowa. Libraries. University Archives",1962|2010-09-12,,"Educational use only, no other permissions given. U.S. and international copyright laws may protect this digital object. Commercial use or distribution of the object is not permitted without prior permission of the copyright holder.","Iowa City Town and Campus Scenes|Frederick W. Kent Collection of Photographs, 1866-2000|http://www.lib.uiowa.edu/collguides/?RG30.0001.01|Prints|Organizations|Scottish Highlanders|Scottish Highlanders|Scanned with Ricoh Aficio 3228C @ 600 ppi. Master image saved in TIFF format",5|5,,"Still image|Photographs|jpeg",RG30.0001.01|index.cpd|https://digital.lib.uiowa.edu/,,,,,,,,,,,,,,,,,,,,,,,,,,,,,,,,,,,,,,,,,,,,,,,,"<a href=""https://digital.lib.uiowa.edu/"" target=""_blank"">View this item in its source respository</a>",,,,,,,,,,,,,,,,,,,,,,,,,,,,,https://www.iowaheritage.org/files/original/069b94f351733ba7662b2409a2f16aab.jpg,"Remote Item","Iowa City Town and Campus Scenes",1,0
30859,https://www.iowaheritage.org/items/show/30859,"Scottish Highlander leader Carolyn Rabe, The University of Iowa, 1962","Universities & colleges|Rabe, Carolyn|University of Iowa|United States -- Iowa -- Iowa City|1960-1970|Drum majors|Band uniforms|Drums|University of Iowa. Scottish Highlanders","Dating back to 1936, the Scottish Highlanders was a student group dedicated to practicing and performing the Scottish arts of piping, drumming and dancing.","Kent, Frederick W. (Frederick Wallace), 1894-1984",,"University of Iowa. Libraries. University Archives",1962|2010-09-12,,"Educational use only, no other permissions given. U.S. and international copyright laws may protect this digital object. Commercial use or distribution of the object is not permitted without prior permission of the copyright holder.","Iowa City Town and Campus Scenes|Frederick W. Kent Collection of Photographs, 1866-2000|http://www.lib.uiowa.edu/collguides/?RG30.0001.01|Prints|Organizations|Scottish Highlanders|Scottish Highlanders|Scanned with Ricoh Aficio 3228C @ 600 ppi. Master image saved in TIFF format",10|8,,"Still image|Photographs|jpeg",RG30.0001.01|index.cpd|https://digital.lib.uiowa.edu/,,,,,,,,,,,,,,,,,,,,,,,,,,,,,,,,,,,,,,,,,,,,,,,,"<a href=""https://digital.lib.uiowa.edu/"" target=""_blank"">View this item in its source respository</a>",,,,,,,,,,,,,,,,,,,,,,,,,,,,,https://www.iowaheritage.org/files/original/ab2d2e89cae2aea4e37be2320ea2980b.jpg,"Remote Item","Iowa City Town and Campus Scenes",1,0
31034,https://www.iowaheritage.org/items/show/31034,"Scottish Highlander drummers, The University of Iowa, 1979","Universities & colleges|Tartans|Isaacs, Mark|University of Iowa|United States -- Iowa -- Iowa City|1970-1980|Bands|Kilts|Drums|Spectators|Drummers (Musicians)|Lacina, Melody|University of Iowa. Scottish Highlanders","Dating back to 1936, the Scottish Highlanders was a student group dedicated to practicing and performing the Scottish arts of piping, drumming and dancing.","Kent, Frederick W. (Frederick Wallace), 1894-1984",,"University of Iowa. Libraries. University Archives",1979|2010-09-12,,"Educational use only, no other permissions given. U.S. and international copyright laws may protect this digital object. Commercial use or distribution of the object is not permitted without prior permission of the copyright holder.","Iowa City Town and Campus Scenes|Frederick W. Kent Collection of Photographs, 1866-2000|http://www.lib.uiowa.edu/collguides/?RG30.0001.01|Prints|Organizations|Scottish Highlanders|Scottish Highlanders|Scanned with Ricoh Aficio 3228C @ 600 ppi. Master image saved in TIFF format",5|7,,"Still image|Photographs|jpeg",RG30.0001.01|index.cpd|https://digital.lib.uiowa.edu/,,,,,,,,,,,,,,,,,,,,,,,,,,,,,,,,,,,,,,,,,,,,,,,,"<a href=""https://digital.lib.uiowa.edu/"" target=""_blank"">View this item in its source respository</a>",,,,,,,,,,,,,,,,,,,,,,,,,,,,,https://www.iowaheritage.org/files/original/69d44ffbd75d841b9e3ae25bbbc53848.jpg,"Remote Item","Iowa City Town and Campus Scenes",1,0
