 




﻿"Item Id","Item URI","Dublin Core:Title","Dublin Core:Subject","Dublin Core:Description","Dublin Core:Creator","Dublin Core:Source","Dublin Core:Publisher","Dublin Core:Date","Dublin Core:Contributor","Dublin Core:Rights","Dublin Core:Relation","Dublin Core:Format","Dublin Core:Language","Dublin Core:Type","Dublin Core:Identifier","Dublin Core:Coverage","Item Type Metadata:Text","Item Type Metadata:Interviewer","Item Type Metadata:Interviewee","Item Type Metadata:Location","Item Type Metadata:Transcription","Item Type Metadata:Local URL","Item Type Metadata:Original Format","Item Type Metadata:Physical Dimensions","Item Type Metadata:Duration","Item Type Metadata:Compression","Item Type Metadata:Producer","Item Type Metadata:Director","Item Type Metadata:Bit Rate/Frequency","Item Type Metadata:Time Summary","Item Type Metadata:Email Body","Item Type Metadata:Subject Line","Item Type Metadata:From","Item Type Metadata:To","Item Type Metadata:CC","Item Type Metadata:BCC","Item Type Metadata:Number of Attachments","Item Type Metadata:Standards","Item Type Metadata:Objectives","Item Type Metadata:Materials","Item Type Metadata:Lesson Plan Text","Item Type Metadata:URL","Item Type Metadata:Event Type","Item Type Metadata:Participants","Item Type Metadata:Birth Date","Item Type Metadata:Birthplace","Item Type Metadata:Death Date","Item Type Metadata:Occupation","Item Type Metadata:Biographical Text","Item Type Metadata:Bibliography","Item Type Metadata:Digital Reproduction Information","Item Type Metadata:Repository","Item Type Metadata:Repository Collection","Item Type Metadata:Contact information.","Item Type Metadata:File Name","Item Type Metadata:Notes","Item Type Metadata:Digital item created","Item Type Metadata:Digital item modified","Item Type Metadata:Executive Orders","Item Type Metadata:Record Created","Item Type Metadata:Record Modified","Item Type Metadata:Transcription2","Item Type Metadata:Source URL","Omeka Legacy File:Additional Creator","Omeka Legacy File:Transcriber","Omeka Legacy File:Producer","Omeka Legacy File:Render Device","Omeka Legacy File:Render Details","Omeka Legacy File:Capture Date","Omeka Legacy File:Capture Device","Omeka Legacy File:Capture Details","Omeka Legacy File:Change History","Omeka Legacy File:Watermark","Omeka Legacy File:Encryption","Omeka Legacy File:Compression","Omeka Legacy File:Post Processing","Omeka Image File:Width","Omeka Image File:Height","Omeka Image File:Bit Depth","Omeka Image File:Channels","Omeka Image File:Exif String","Omeka Image File:Exif Array","Omeka Image File:IPTC String","Omeka Image File:IPTC Array","Omeka Video File:Bitrate","Omeka Video File:Duration","Omeka Video File:Sample Rate","Omeka Video File:Codec","Omeka Video File:Width","Omeka Video File:Height",tags,file,itemType,collection,public,featured
97549,https://www.iowaheritage.org/items/show/97549,"Aerial views of Cherokee County farmland.","Cherokee County Soil and Water Conservation District ","Aerial views of Cherokee County farmland.","Cherokee County Soil and Water Conservation District ",,"State Library of Iowa|Cherokee County Soil and Water Conservation District ",[1992],"Cherokee County Soil and Water Conservation District of Iowa. For questions about copyright, contact the State Library of Iowa at  <a href=""http://www.statelibraryofiowa.org"">http://www.statelibraryofiowa.org</a>.","This item is protected by copyright and/or related rights. Your are free to use this Item in any way that is permitted by the copyright and related rights legislation that applies to your use. For other uses you need to obtain permission from the rights-holder(s). <a href=""http://rightsstatements.org/"">http://rightsstatements.org</a>",,jpeg,eng,Photograph,,,,,,,,,,,,,,,,,,,,,,,,,,,,,,,,,,,,,,,,,,,,,,,,,,,,,,,,,,,,,,,,,,,,,,,,,,,,,"Cherokee County Iowa,Farmland,Soil and Water Conservation","https://www.iowaheritage.org/files/original/c0bcd986709cfbbc05c7da9ff2a37a71.jpg,https://www.iowaheritage.org/files/original/1db2d99fa23c368fc9c9aafddd149e3c.jpg,https://www.iowaheritage.org/files/original/e520e7470c54cbb3ee16da1616a8d135.jpg,https://www.iowaheritage.org/files/original/45a07d5e536adabefefb173c2092abd9.jpg,https://www.iowaheritage.org/files/original/d9c856aa5f797d9d4d839ebca087dd71.jpg,https://www.iowaheritage.org/files/original/0b0561905bb43cd7b5b772bb1fcf8b55.jpg,https://www.iowaheritage.org/files/original/7e70d5f00ca9ecce2c6739c502a9a9d3.jpg,https://www.iowaheritage.org/files/original/cae8436a02afd53e14c2117ac6200b6f.jpg,https://www.iowaheritage.org/files/original/aa9fd23f24ce4e6ef268b94163b33080.jpg,https://www.iowaheritage.org/files/original/4f3539c16580dc2f088f12fe87ec7ba4.jpg,https://www.iowaheritage.org/files/original/65ea36faf3d3c9fbdaa822d1d6850ce4.jpg,https://www.iowaheritage.org/files/original/83a4aae6efbeead5d4171d656a724d59.jpg,https://www.iowaheritage.org/files/original/f1bc6d00128c086e8fe9c0245a88f767.jpg,https://www.iowaheritage.org/files/original/a71c8a7de5bbb53f5db34ccd933f72f6.jpg,https://www.iowaheritage.org/files/original/8d1d3700300cf0a192aaf64637279fee.jpg,https://www.iowaheritage.org/files/original/84c12aeb1a800adaa0e148825eb9d082.jpg,https://www.iowaheritage.org/files/original/718e37ab7bb3e76fb1df4bb2b8b2430d.jpg,https://www.iowaheritage.org/files/original/866f1c6b4b630a5925074b95f9374c96.jpg,https://www.iowaheritage.org/files/original/8c144dd5432ebb126e939f6da214e052.jpg,https://www.iowaheritage.org/files/original/b93c15a8d655d8958f8ff722acc578b1.jpg,https://www.iowaheritage.org/files/original/1e9d73aef574c7e5946795bce58121e0.jpg,https://www.iowaheritage.org/files/original/6149c05f32063961af9e4353bf796145.jpg","Still Image","Cherokee County Soil and Water Conservation District Historical Collection",1,0
97552,https://www.iowaheritage.org/items/show/97552,"Russ Carver's farm.","Cherokee County Soil and Water Conservation District ","Russ Carver's farm in Cherokee County, Iowa.","Cherokee County Soil and Water Conservation District ",,"State Library of Iowa|Cherokee County Soil and Water Conservation District ",1985-88,"Cherokee County Soil and Water Conservation District of Iowa. For questions about copyright, contact the State Library of Iowa at  <a href=""http://www.statelibraryofiowa.org"">http://www.statelibraryofiowa.org</a>.","This item is protected by copyright and/or related rights. Your are free to use this Item in any way that is permitted by the copyright and related rights legislation that applies to your use. For other uses you need to obtain permission from the rights-holder(s). <a href=""http://rightsstatements.org/"">http://rightsstatements.org</a>",,jpeg,,Photograph,,,,,,,,,,,,,,,,,,,,,,,,,,,,,,,,,,,,,,,,,,,,,,,,,,,,,,,,,,,,,,,,,,,,,,,,,,,,,"Cherokee County Iowa,Farmland,Russ Carver Farm,Soil and Water Conservation","https://www.iowaheritage.org/files/original/30a96af197d8853f25656285977ddb2f.jpg,https://www.iowaheritage.org/files/original/c110c95e2dd6de09d623ac5659a39109.jpg,https://www.iowaheritage.org/files/original/5eae7da6a4cdffffabe0a2b8fbe53471.jpg,https://www.iowaheritage.org/files/original/8d636d6fd3c70b603ef42bd3b196d40d.jpg,https://www.iowaheritage.org/files/original/2adfc6fa5d6c356a27be4fa23d6bc2d9.jpg","Still Image","Cherokee County Soil and Water Conservation District Historical Collection",1,0
97659,https://www.iowaheritage.org/items/show/97659,"Bryan Berner farmland","Jackson County Soil and Water Conservation District|Berner, Bryan","Color aerial photographs of Berner farmland. ","Jackson County Soil and Water Conservation District ",,"State Library of Iowa",Unknown,"Jackson County Soil and Water Conservation District. For questions about copyright, contact the State Library of Iowa at  <a href=""http://www.statelibraryofiowa.org"">http://www.statelibraryofiowa.org</a>.","This item is protected by copyright and/or related rights. Your are free to use this Item in any way that is permitted by the copyright and related rights legislation that applies to your use. For other uses you need to obtain permission from the rights-holder(s). <a href=""http://rightsstatements.org/"">http://rightsstatements.org</a>",,jpg,eng,"Still Image; Photograph",,,,,,,,,,,,,,,,,,,,,,,,,,,,,,,,,,,,,,,,,Bryan_Berner_20191209_001,,,,,,,,,,,,,,,,,,,,,,,,,,,,,,,,,,,,"Bryan Berner,Farmland,Jackson County Soil and Water Conservation District",https://www.iowaheritage.org/files/original/049d16488bd3c10d23cfffab0688102a.jpg,"Still Image","Jackson County Soil and Water Conservation District Historic Collection",1,0
97661,https://www.iowaheritage.org/items/show/97661,"Dave Gregorich farmland","Jackson County Soil and Water Conservation District |Gregorich, Dave","Color aerial photographs of Dave Gregorich farmland. ","Jackson County Soil and Water Conservation District ",,"State Library of Iowa",Unknown,"Jackson County Soil and Water Conservation District. For questions about copyright, contact the State Library of Iowa at  <a href=""http://www.statelibraryofiowa.org"">http://www.statelibraryofiowa.org</a>.","This item is protected by copyright and/or related rights. Your are free to use this Item in any way that is permitted by the copyright and related rights legislation that applies to your use. For other uses you need to obtain permission from the rights-holder(s). <a href=""http://rightsstatements.org/"">http://rightsstatements.org</a>",,jpg,eng,"Still Image; Photograph",,,,,,,,,,,,,,,,,,,,,,,,,,,,,,,,,,,,,,,,,Dave_Gregorich_20191209_001,,,,,,,,,,,,,,,,,,,,,,,,,,,,,,,,,,,,"Dave Gregorich,Farmland,Jackson County Soil and Water Conservation District",https://www.iowaheritage.org/files/original/367bffaefc8f38a1ba6589cabcc91da4.jpg,"Still Image","Jackson County Soil and Water Conservation District Historic Collection",1,0
97677,https://www.iowaheritage.org/items/show/97677,"Randy Ganzer farmland","Jackson County Soil and Water Conservation District ","Color aerial photograph series of Randy Ganzer farmland. ","Jackson County Soil and Water Conservation District ",,"State Library of Iowa",Unknown,"Jackson County Soil and Water Conservation District. For questions about copyright, contact the State Library of Iowa at  <a href=""http://www.statelibraryofiowa.org"">http://www.statelibraryofiowa.org</a>.","This item is protected by copyright and/or related rights. Your are free to use this Item in any way that is permitted by the copyright and related rights legislation that applies to your use. For other uses you need to obtain permission from the rights-holder(s). <a href=""http://rightsstatements.org/"">http://rightsstatements.org</a>",,jpg|pdf,eng,"Still Image; Photograph",,,,,,,,,,,,,,,,,,,,,,,,,,,,,,,,,,,,,,,,,Randy_Ganzer_2000_20191209_001,,,,,,,,,,,,,,,,,,,,,,,,,,,,,,,,,,,,"Farmland,Jackson County Soil and Water Conservation District,Randy Ganzer",https://www.iowaheritage.org/files/original/4ace975f0a092402606c7f11200406b4.pdf,"Still Image","Jackson County Soil and Water Conservation District Historic Collection",1,0
97679,https://www.iowaheritage.org/items/show/97679,"Harold's strips","Jackson County Soil and Water Conservation District ","Color aerial photograph of Harold's strips. ","Jackson County Soil and Water Conservation District ",,"State Library of Iowa",Unknown,"Jackson County Soil and Water Conservation District. For questions about copyright, contact the State Library of Iowa at  <a href=""http://www.statelibraryofiowa.org"">http://www.statelibraryofiowa.org</a>.","This item is protected by copyright and/or related rights. Your are free to use this Item in any way that is permitted by the copyright and related rights legislation that applies to your use. For other uses you need to obtain permission from the rights-holder(s). <a href=""http://rightsstatements.org/"">http://rightsstatements.org</a>",,jpg|pdf,eng,"Still Image; Photograph",,,,,,,,,,,,,,,,,,,,,,,,,,,,,,,,,,,,,,,,,Harolds_strips_20191206_001,,,,,,,,,,,,,,,,,,,,,,,,,,,,,,,,,,,,"Farmland,Jackson County Soil and Water Conservation District",https://www.iowaheritage.org/files/original/6bac0e09e4c0f8ff0d0512a46a3fcc02.jpg,"Still Image","Jackson County Soil and Water Conservation District Historic Collection",1,0
97680,https://www.iowaheritage.org/items/show/97680,"Kent Marshall farmland","Jackson County Soil and Water Conservation District","Color aerial slides of Kent Marshall's farmland.","Jackson County Soil and Water Conservation District ",,"State Library of Iowa",Unknown,"Jackson County Soil and Water Conservation District. For questions about copyright, contact the State Library of Iowa at  <a href=""http://www.statelibraryofiowa.org"">http://www.statelibraryofiowa.org</a>.","This item is protected by copyright and/or related rights. Your are free to use this Item in any way that is permitted by the copyright and related rights legislation that applies to your use. For other uses you need to obtain permission from the rights-holder(s). <a href=""http://rightsstatements.org/"">http://rightsstatements.org</a>",,jpg|pdf,eng,"Still Image; Photograph",,,,,,,,,,,,,,,,,,,,,,,,,,,,,,,,,,,,,,,,,Kent_Marshall_06_03_2000_20191209_001,,,,,,,,,,,,,,,,,,,,,,,,,,,,,,,,,,,,"Farmland,Jackson County Soil and Water Conservation District,Kent Marshall","https://www.iowaheritage.org/files/original/1c295e6eeb204cee5613084924eb3703.jpg,https://www.iowaheritage.org/files/original/a89fd8e4261caefa18e3528dc3ca1d31.jpg,https://www.iowaheritage.org/files/original/68bf578b0129973ad09ca2abbab1fc4d.jpg","Still Image","Jackson County Soil and Water Conservation District Historic Collection",1,0
97682,https://www.iowaheritage.org/items/show/97682,"Mike Clasen farmland","Jackson County Soil and Water Conservation District ","Color aerial photograph series of Mike Clasen's farmland. ","Jackson County Soil and Water Conservation District ",,"State Library of Iowa",Unknown,"Jackson County Soil and Water Conservation District. For questions about copyright, contact the State Library of Iowa at  <a href=""http://www.statelibraryofiowa.org"">http://www.statelibraryofiowa.org</a>.","This item is protected by copyright and/or related rights. Your are free to use this Item in any way that is permitted by the copyright and related rights legislation that applies to your use. For other uses you need to obtain permission from the rights-holder(s). <a href=""http://rightsstatements.org/"">http://rightsstatements.org</a>",,jpg,eng,"Still Image; Photograph",,,,,,,,,,,,,,,,,,,,,,,,,,,,,,,,,,,,,,,,,Mike_Clasen_20191209_001,,,,,,,,,,,,,,,,,,,,,,,,,,,,,,,,,,,,"Farmland,Jackson County Soil and Water Conservation District,Mike Clasen","https://www.iowaheritage.org/files/original/189d983fa88d17125670a58fb9d19980.jpg,https://www.iowaheritage.org/files/original/adc711a6f3bcd122460ba7f06cc08929.jpg,https://www.iowaheritage.org/files/original/d82c0f048161e3015237bfd3031f6972.jpg","Still Image","Jackson County Soil and Water Conservation District Historic Collection",1,0
97799,https://www.iowaheritage.org/items/show/97799,"Carl Anderson poor pasture, 1983","Henry County Soil and Water Conservation District|Farmland","Color slide of overgrown pastureland. ","Henry County Soil and Water Conservation District ",,"State Library of Iowa",1983,"Henry County Soil and Water Conservation District of Iowa. For questions about copyright, contact the State Library of Iowa at  <a href=""http://www.statelibraryofiowa.org"">http://www.statelibraryofiowa.org</a>.","This item is protected by copyright and/or related rights. Your are free to use this Item in any way that is permitted by the copyright and related rights legislation that applies to your use. For other uses you need to obtain permission from the rights-holder(s). <a href=""http://rightsstatements.org/"">http://rightsstatements.org</a>",,jpg,,"Still Image; Slide",,,,,,,,,,,,,,,,,,,,,,,,,,,,,,,,,,,,,,,,,Poor_Pasture_Carl_Anderson_1980s,,,,,,,,,,,,,,,,,,,,,,,,,,,,,,,,,,,,"Farmland,Henry County Soil and Water Conservation District",https://www.iowaheritage.org/files/original/d0a00a6fe22aa74b5c41bd3953b81067.jpg,"Still Image","Henry County Soil and Water Conservation District Historical Collection ",1,0
97896,https://www.iowaheritage.org/items/show/97896,"Union Township, Section 29 & 30.","Appanoose County Soil and Water Conservation District ","Aerial photo of Union Township, Section 29 & 30, in Appanoose County, Iowa.","Appanoose County Soil and Water Conservation District ",,"State Library of Iowa|Appanoose County Soil and Water Conservation District ",1965,"Appanoose County Soil and Water Conservation District. For questions about copyright, contact the State Library of Iowa at  <a href=""http://www.statelibraryofiowa.org"">http://www.statelibraryofiowa.org</a>.","This item is protected by copyright and/or related rights. Your are free to use this Item in any way that is permitted by the copyright and related rights legislation that applies to your use. For other uses you need to obtain permission from the rights-holder(s). <a href=""http://rightsstatements.org/"">http://rightsstatements.org</a>",,jpeg,eng,"Still Image; Photograph",,,,,,,,,,,,,,,,,,,,,,,,,,,,,,,,,,,,,,,,,,,,,,,,,,,,,,,,,,,,,,,,,,,,,,,,,,,,,"Appanoose County,Farmland,Soil and Water Conservation,Union Township","https://www.iowaheritage.org/files/original/5e1f06418ad2edd117ac80906e3d874e.jpg,https://www.iowaheritage.org/files/original/a43d934cfc198ba8f3d60baae8b03d6e.jpg,https://www.iowaheritage.org/files/original/0e88aba98d3d8556c8f7e54fe6a35ccf.jpg,https://www.iowaheritage.org/files/original/4dfec45b8dcc87aec703ffce3baec54e.jpg,https://www.iowaheritage.org/files/original/74022d2e10784003d3ff77296323327b.jpg,https://www.iowaheritage.org/files/original/91950669b15de2db01ab655aefac3901.jpg,https://www.iowaheritage.org/files/original/b487bad370da7a6e352da2d6680a926a.jpg,https://www.iowaheritage.org/files/original/acd9ac85496ddc3da492e875d59b977a.jpg,https://www.iowaheritage.org/files/original/6647089465e51c646d3a6d5c70744854.jpg,https://www.iowaheritage.org/files/original/bee5c846c93256fe77dabd50ae1fc976.jpg,https://www.iowaheritage.org/files/original/a7284d0f9b7bb6cfd7da0c6393cba4a9.jpg","Still Image","Appanoose County Soil and Water Conservation District Historic Collection",1,0
