 




﻿"Item Id","Item URI","Dublin Core:Title","Dublin Core:Subject","Dublin Core:Description","Dublin Core:Creator","Dublin Core:Source","Dublin Core:Publisher","Dublin Core:Date","Dublin Core:Contributor","Dublin Core:Rights","Dublin Core:Relation","Dublin Core:Format","Dublin Core:Language","Dublin Core:Type","Dublin Core:Identifier","Dublin Core:Coverage","Item Type Metadata:Text","Item Type Metadata:Interviewer","Item Type Metadata:Interviewee","Item Type Metadata:Location","Item Type Metadata:Transcription","Item Type Metadata:Local URL","Item Type Metadata:Original Format","Item Type Metadata:Physical Dimensions","Item Type Metadata:Duration","Item Type Metadata:Compression","Item Type Metadata:Producer","Item Type Metadata:Director","Item Type Metadata:Bit Rate/Frequency","Item Type Metadata:Time Summary","Item Type Metadata:Email Body","Item Type Metadata:Subject Line","Item Type Metadata:From","Item Type Metadata:To","Item Type Metadata:CC","Item Type Metadata:BCC","Item Type Metadata:Number of Attachments","Item Type Metadata:Standards","Item Type Metadata:Objectives","Item Type Metadata:Materials","Item Type Metadata:Lesson Plan Text","Item Type Metadata:URL","Item Type Metadata:Event Type","Item Type Metadata:Participants","Item Type Metadata:Birth Date","Item Type Metadata:Birthplace","Item Type Metadata:Death Date","Item Type Metadata:Occupation","Item Type Metadata:Biographical Text","Item Type Metadata:Bibliography","Item Type Metadata:Digital Reproduction Information","Item Type Metadata:Repository","Item Type Metadata:Repository Collection","Item Type Metadata:Contact information.","Item Type Metadata:File Name","Item Type Metadata:Notes","Item Type Metadata:Digital item created","Item Type Metadata:Digital item modified","Item Type Metadata:Executive Orders","Item Type Metadata:Record Created","Item Type Metadata:Record Modified","Item Type Metadata:Transcription2","Item Type Metadata:Source URL","Omeka Legacy File:Additional Creator","Omeka Legacy File:Transcriber","Omeka Legacy File:Producer","Omeka Legacy File:Render Device","Omeka Legacy File:Render Details","Omeka Legacy File:Capture Date","Omeka Legacy File:Capture Device","Omeka Legacy File:Capture Details","Omeka Legacy File:Change History","Omeka Legacy File:Watermark","Omeka Legacy File:Encryption","Omeka Legacy File:Compression","Omeka Legacy File:Post Processing","Omeka Image File:Width","Omeka Image File:Height","Omeka Image File:Bit Depth","Omeka Image File:Channels","Omeka Image File:Exif String","Omeka Image File:Exif Array","Omeka Image File:IPTC String","Omeka Image File:IPTC Array","Omeka Video File:Bitrate","Omeka Video File:Duration","Omeka Video File:Sample Rate","Omeka Video File:Codec","Omeka Video File:Width","Omeka Video File:Height",tags,file,itemType,collection,public,featured
9534,https://www.iowaheritage.org/items/show/9534,"The start of the 1948 race.","Government|Green, William, 1872-1952|Elections 1948|Donkeys|politics|elections|candidates|Democratic Party|Murray, Philip, 1886-1952|Truman, Harry S., 1884-1972|Miss Democracy.",,"Darling, Jay N. (Jay Norwood), 1876-1962","The Editorial cartoons of J.N. ""Ding"" Darling [electronic resource] : The Cowles Collection, Drake University, 1912-1962",,1947/09/04|1947,,"Copyright is owned by the ""Ding"" Darling Wildlife Society; it is administered on behalf of the Society by The University of Iowa. While use within the classroom is encouraged without specific authorization, publishing this cartoon in any format requires written permission. See policy and permissions procedure at: http://www.lib.uiowa.edu/spec-coll/services/dingdarling_fees.html","Cowles Library, Drake University, 2507 University Ave., Des Moines, IA 50311-4505.",,,,"470904.jpg|http://ddr.lib.drake.edu/u?/ddarling,6464",,,,,,,,,,,,,,,,,,,,,,,,,,,,,,,,,,,,,,,,,,,,,,,,"<a href=""http://ddr.lib.drake.edu/u?/ddarling,6464"" target=""_blank"">View this item in its source respository</a>",,,,,,,,,,,,,,,,,,,,,,,,,,,,,https://www.iowaheritage.org/files/original/efe3a4bf53ebdb2543276f635106d43c.jpg,"Remote Item","Editorial Cartoons of J.N. ""Ding"" Darling, Drake University",1,0
9665,https://www.iowaheritage.org/items/show/9665,"Either that or go hungry.","Government|Eisenhower, Dwight D. (Dwight David), 1890-1969|Elections 1948|Donkeys|politics|elections|candidates|Democratic Party|Republican Party|elephants|hunting.",,"Darling, Jay N. (Jay Norwood), 1876-1962","The Editorial cartoons of J.N. ""Ding"" Darling [electronic resource] : The Cowles Collection, Drake University, 1912-1962",,1948/06/05|1948,,"Copyright is owned by the ""Ding"" Darling Wildlife Society; it is administered on behalf of the Society by The University of Iowa. While use within the classroom is encouraged without specific authorization, publishing this cartoon in any format requires written permission. See policy and permissions procedure at: http://www.lib.uiowa.edu/spec-coll/services/dingdarling_fees.html","Cowles Library, Drake University, 2507 University Ave., Des Moines, IA 50311-4505.",,,,"480605.jpg|http://ddr.lib.drake.edu/u?/ddarling,6595",,,,,,,,,,,,,,,,,,,,,,,,,,,,,,,,,,,,,,,,,,,,,,,,"<a href=""http://ddr.lib.drake.edu/u?/ddarling,6595"" target=""_blank"">View this item in its source respository</a>",,,,,,,,,,,,,,,,,,,,,,,,,,,,,https://www.iowaheritage.org/files/original/1355cbbc9d9d71e55391833a4d781034.jpg,"Remote Item","Editorial Cartoons of J.N. ""Ding"" Darling, Drake University",1,0
9683,https://www.iowaheritage.org/items/show/9683,"Hey, mister, you've lost something.","Government|Truman, Harry S., 1884-1972|Elections 1948|Miss Democracy|politics|elections|third parties|Democratic Party|Wallace, Henry Agard, 1888-1965||donkeys|groceries.",,"Darling, Jay N. (Jay Norwood), 1876-1962","The Editorial cartoons of J.N. ""Ding"" Darling [electronic resource] : The Cowles Collection, Drake University, 1912-1962",,1948/07/26|1948,,"Copyright is owned by the ""Ding"" Darling Wildlife Society; it is administered on behalf of the Society by The University of Iowa. While use within the classroom is encouraged without specific authorization, publishing this cartoon in any format requires written permission. See policy and permissions procedure at: http://www.lib.uiowa.edu/spec-coll/services/dingdarling_fees.html","Cowles Library, Drake University, 2507 University Ave., Des Moines, IA 50311-4505.",,,,"480726.jpg|http://ddr.lib.drake.edu/u?/ddarling,6613",,,,,,,,,,,,,,,,,,,,,,,,,,,,,,,,,,,,,,,,,,,,,,,,"<a href=""http://ddr.lib.drake.edu/u?/ddarling,6613"" target=""_blank"">View this item in its source respository</a>",,,,,,,,,,,,,,,,,,,,,,,,,,,,,https://www.iowaheritage.org/files/original/80a1a91022333b40ddcff06fbd8cbb7f.jpg,"Remote Item","Editorial Cartoons of J.N. ""Ding"" Darling, Drake University",1,0
9732,https://www.iowaheritage.org/items/show/9732,"Haven't we something else he can split before quitting?","Government|Truman, Harry S., 1884-1972|Elections 1948|Donkeys|politics|elections|candidates|Democratic Party|Miss Democracy|hatchets.",,"Darling, Jay N. (Jay Norwood), 1876-1962","The Editorial cartoons of J.N. ""Ding"" Darling [electronic resource] : The Cowles Collection, Drake University, 1912-1962",,1948/10/28|1948,,"Copyright is owned by the ""Ding"" Darling Wildlife Society; it is administered on behalf of the Society by The University of Iowa. While use within the classroom is encouraged without specific authorization, publishing this cartoon in any format requires written permission. See policy and permissions procedure at: http://www.lib.uiowa.edu/spec-coll/services/dingdarling_fees.html","Cowles Library, Drake University, 2507 University Ave., Des Moines, IA 50311-4505.",,,,"481028.jpg|http://ddr.lib.drake.edu/u?/ddarling,6662",,,,,,,,,,,,,,,,,,,,,,,,,,,,,,,,,,,,,,,,,,,,,,,,"<a href=""http://ddr.lib.drake.edu/u?/ddarling,6662"" target=""_blank"">View this item in its source respository</a>",,,,,,,,,,,,,,,,,,,,,,,,,,,,,https://www.iowaheritage.org/files/original/2b6d32ad5969ee5ed834b4da9f10694e.jpg,"Remote Item","Editorial Cartoons of J.N. ""Ding"" Darling, Drake University",1,0
9735,https://www.iowaheritage.org/items/show/9735,"The Great Divide.","Government|Elections 1948|Skiing|politics|elections|states rights|Democratic Party|donkeys|Miss Democracy.",,"Darling, Jay N. (Jay Norwood), 1876-1962","The Editorial cartoons of J.N. ""Ding"" Darling [electronic resource] : The Cowles Collection, Drake University, 1912-1962",,1948/11/01|1948,,"Copyright is owned by the ""Ding"" Darling Wildlife Society; it is administered on behalf of the Society by The University of Iowa. While use within the classroom is encouraged without specific authorization, publishing this cartoon in any format requires written permission. See policy and permissions procedure at: http://www.lib.uiowa.edu/spec-coll/services/dingdarling_fees.html","Cowles Library, Drake University, 2507 University Ave., Des Moines, IA 50311-4505.",,,,"481101.jpg|http://ddr.lib.drake.edu/u?/ddarling,6665",,,,,,,,,,,,,,,,,,,,,,,,,,,,,,,,,,,,,,,,,,,,,,,,"<a href=""http://ddr.lib.drake.edu/u?/ddarling,6665"" target=""_blank"">View this item in its source respository</a>",,,,,,,,,,,,,,,,,,,,,,,,,,,,,https://www.iowaheritage.org/files/original/34f8894df9d2ec079bf09d85b299ff96.jpg,"Remote Item","Editorial Cartoons of J.N. ""Ding"" Darling, Drake University",1,0
64189,https://www.iowaheritage.org/items/show/64189,"Al Quixote","Candidates|Gore, Albert, 1948-|United States|Knights|2000-2010|Vice presidents|Presidency|Presidents -- United States|Presidents -- United States -- Election -- 2000|Votes|Lieberman, Joseph I.|Men|Donkeys|Windmills|Spears",,"Duffy, Brian, 1955-",,"University of Iowa. Libraries. Special Collections Dept.",2000-11-28|2011-04,,"Educational use only, no other permissions given. Copyright to this digital object is owned by The Des Moines Register; it may not be downloaded, reproduced, or distributed without written permission. For more information, contact the Special Collections Department.","Editorial Cartoons of Brian Duffy; Des Moines Register Cartoonists|Papers of Brian Duffy|Des Moines Register",,English,"Still image|Editorial cartoons",MSC916|duffy-001128|http://digital.lib.uiowa.edu/cdm/ref/collection/duffy/id/27,,,,,,,,,,,,,,,,,,,,,,,,,,,,,,,,,,,,,,,,,,,,,,,,"<a href=""http://digital.lib.uiowa.edu/cdm/ref/collection/duffy/id/27"" target=""_blank"">View this item in its source respository</a>",,,,,,,,,,,,,,,,,,,,,,,,,,,,,https://www.iowaheritage.org/files/original/6973fc685a7f9614ffb9261c503dc90d.jpg,"Remote Item","Editorial Cartoons of Brian Duffy",1,0
64230,https://www.iowaheritage.org/items/show/64230,"I don't know how much longer I can keep this up ... my teeth are beginning to hurt ...","Political parties|United States|Elephants|2000-2010|Partisanship|Unity|United States. Congress|Donkeys|Teeth",Congress,"Duffy, Brian, 1955-",,"University of Iowa. Libraries. Special Collections Dept.",2001-10-14|2011-04,,"Educational use only, no other permissions given. Copyright to this digital object is owned by The Des Moines Register; it may not be downloaded, reproduced, or distributed without written permission. For more information, contact the Special Collections Department.","Editorial Cartoons of Brian Duffy; Des Moines Register Cartoonists|Papers of Brian Duffy|Des Moines Register",,English,"Still image|Editorial cartoons",MSC916|duffy-011014|http://digital.lib.uiowa.edu/cdm/ref/collection/duffy/id/68,,,,,,,,,,,,,,,,,,,,,,,,,,,,,,,,,,,,,,,,,,,,,,,,"<a href=""http://digital.lib.uiowa.edu/cdm/ref/collection/duffy/id/68"" target=""_blank"">View this item in its source respository</a>",,,,,,,,,,,,,,,,,,,,,,,,,,,,,https://www.iowaheritage.org/files/original/c2f6ae2f8695aadfb0e583f820f961fd.jpg,"Remote Item","Editorial Cartoons of Brian Duffy",1,0
64281,https://www.iowaheritage.org/items/show/64281,"Neck and neck and neck and neck","Campaigning|Kerry, John, 1943-|Iowa|Donkeys|2000-2010|Campaigns|Democrats|Candidates|Primaries|Caucus|Nominations for office|Presidency|Dean, Howard, 1948-|Gephardt, Richard A. (Richard Andrew), 1941-|Edwards, John, 1953 June 10-|Men|Candidates|Racetracks","Iowa; Get the camera ready!","Duffy, Brian, 1955-",,"University of Iowa. Libraries. Special Collections Dept.",2004-01-16|2011-04,,"Educational use only, no other permissions given. Copyright to this digital object is owned by The Des Moines Register; it may not be downloaded, reproduced, or distributed without written permission. For more information, contact the Special Collections Department.","Editorial Cartoons of Brian Duffy; Des Moines Register Cartoonists|Papers of Brian Duffy|Des Moines Register",,English,"Still image|Editorial cartoons",MSC916|duffy-040116|http://digital.lib.uiowa.edu/cdm/ref/collection/duffy/id/119,,,,,,,,,,,,,,,,,,,,,,,,,,,,,,,,,,,,,,,,,,,,,,,,"<a href=""http://digital.lib.uiowa.edu/cdm/ref/collection/duffy/id/119"" target=""_blank"">View this item in its source respository</a>",,,,,,,,,,,,,,,,,,,,,,,,,,,,,https://www.iowaheritage.org/files/original/f5ea3cb74f5e81f9bc0a748e4e8e3438.jpg,"Remote Item","Editorial Cartoons of Brian Duffy",1,0
64285,https://www.iowaheritage.org/items/show/64285,"Still wandering in the wilderness","Elections|United States|Donkeys|2000-2010|Politics|Political parties|Politicians|Congress|Democrats|Losers|Deserts|Footprints|Lizards",,"Duffy, Brian, 1955-",,"University of Iowa. Libraries. Special Collections Dept.",2004-11-05|2011-04,,"Educational use only, no other permissions given. Copyright to this digital object is owned by The Des Moines Register; it may not be downloaded, reproduced, or distributed without written permission. For more information, contact the Special Collections Department.","Editorial Cartoons of Brian Duffy; Des Moines Register Cartoonists|Papers of Brian Duffy|Des Moines Register",,English,"Still image|Editorial cartoons",MSC916|duffy-041105|http://digital.lib.uiowa.edu/cdm/ref/collection/duffy/id/123,,,,,,,,,,,,,,,,,,,,,,,,,,,,,,,,,,,,,,,,,,,,,,,,"<a href=""http://digital.lib.uiowa.edu/cdm/ref/collection/duffy/id/123"" target=""_blank"">View this item in its source respository</a>",,,,,,,,,,,,,,,,,,,,,,,,,,,,,https://www.iowaheritage.org/files/original/358369c373f00b7133356f1b715895e5.jpg,"Remote Item","Editorial Cartoons of Brian Duffy",1,0
64286,https://www.iowaheritage.org/items/show/64286,"Looks like the two of you are going to have to cooperate","Elections|United States|Women|2000-2010|Politics|Political parties|Politicians|Congress|Democrats|Republicans|Donkeys|Elephants",,"Duffy, Brian, 1955-",,"University of Iowa. Libraries. Special Collections Dept.",2004-11-07|2011-04,,"Educational use only, no other permissions given. Copyright to this digital object is owned by The Des Moines Register; it may not be downloaded, reproduced, or distributed without written permission. For more information, contact the Special Collections Department.","Editorial Cartoons of Brian Duffy; Des Moines Register Cartoonists|Papers of Brian Duffy|Des Moines Register",,English,"Still image|Editorial cartoons",MSC916|duffy-041107|http://digital.lib.uiowa.edu/cdm/ref/collection/duffy/id/124,,,,,,,,,,,,,,,,,,,,,,,,,,,,,,,,,,,,,,,,,,,,,,,,"<a href=""http://digital.lib.uiowa.edu/cdm/ref/collection/duffy/id/124"" target=""_blank"">View this item in its source respository</a>",,,,,,,,,,,,,,,,,,,,,,,,,,,,,https://www.iowaheritage.org/files/original/0191d425b02da650f39cd8a394045004.jpg,"Remote Item","Editorial Cartoons of Brian Duffy",1,0
