 




﻿"Item Id","Item URI","Dublin Core:Title","Dublin Core:Subject","Dublin Core:Description","Dublin Core:Creator","Dublin Core:Source","Dublin Core:Publisher","Dublin Core:Date","Dublin Core:Contributor","Dublin Core:Rights","Dublin Core:Relation","Dublin Core:Format","Dublin Core:Language","Dublin Core:Type","Dublin Core:Identifier","Dublin Core:Coverage","Item Type Metadata:Text","Item Type Metadata:Interviewer","Item Type Metadata:Interviewee","Item Type Metadata:Location","Item Type Metadata:Transcription","Item Type Metadata:Local URL","Item Type Metadata:Original Format","Item Type Metadata:Physical Dimensions","Item Type Metadata:Duration","Item Type Metadata:Compression","Item Type Metadata:Producer","Item Type Metadata:Director","Item Type Metadata:Bit Rate/Frequency","Item Type Metadata:Time Summary","Item Type Metadata:Email Body","Item Type Metadata:Subject Line","Item Type Metadata:From","Item Type Metadata:To","Item Type Metadata:CC","Item Type Metadata:BCC","Item Type Metadata:Number of Attachments","Item Type Metadata:Standards","Item Type Metadata:Objectives","Item Type Metadata:Materials","Item Type Metadata:Lesson Plan Text","Item Type Metadata:URL","Item Type Metadata:Event Type","Item Type Metadata:Participants","Item Type Metadata:Birth Date","Item Type Metadata:Birthplace","Item Type Metadata:Death Date","Item Type Metadata:Occupation","Item Type Metadata:Biographical Text","Item Type Metadata:Bibliography","Item Type Metadata:Digital Reproduction Information","Item Type Metadata:Repository","Item Type Metadata:Repository Collection","Item Type Metadata:Contact information.","Item Type Metadata:File Name","Item Type Metadata:Notes","Item Type Metadata:Digital item created","Item Type Metadata:Digital item modified","Item Type Metadata:Executive Orders","Item Type Metadata:Record Created","Item Type Metadata:Record Modified","Item Type Metadata:Transcription2","Item Type Metadata:Source URL","Omeka Legacy File:Additional Creator","Omeka Legacy File:Transcriber","Omeka Legacy File:Producer","Omeka Legacy File:Render Device","Omeka Legacy File:Render Details","Omeka Legacy File:Capture Date","Omeka Legacy File:Capture Device","Omeka Legacy File:Capture Details","Omeka Legacy File:Change History","Omeka Legacy File:Watermark","Omeka Legacy File:Encryption","Omeka Legacy File:Compression","Omeka Legacy File:Post Processing","Omeka Image File:Width","Omeka Image File:Height","Omeka Image File:Bit Depth","Omeka Image File:Channels","Omeka Image File:Exif String","Omeka Image File:Exif Array","Omeka Image File:IPTC String","Omeka Image File:IPTC Array","Omeka Video File:Bitrate","Omeka Video File:Duration","Omeka Video File:Sample Rate","Omeka Video File:Codec","Omeka Video File:Width","Omeka Video File:Height",tags,file,itemType,collection,public,featured
64295,https://www.iowaheritage.org/items/show/64295,"Missing anything?","Congress|Iowa|Santa Claus|2000-2010|Congressional Appropriations|Congressional spending|Funding|Budgets -- United States|Washington (D.C.)|Women|Christmas lights|Christmas trees|Bags|Paper","How about lights?; Congress; Omnibus Spending Bill; Street light study $250,000.00; Jordan Creek Interchange $1.5 million; Riverwalk $2 million; Science Center $500,000.00; New windows for Hoyt Sherman $300,000.00","Duffy, Brian, 1955-",,"University of Iowa. Libraries. Special Collections Dept.",2004-11-26|2011-04,,"Educational use only, no other permissions given. Copyright to this digital object is owned by The Des Moines Register; it may not be downloaded, reproduced, or distributed without written permission. For more information, contact the Special Collections Department.","Editorial Cartoons of Brian Duffy; Des Moines Register Cartoonists|Papers of Brian Duffy|Des Moines Register",,English,"Still image|Editorial cartoons",MSC916|duffy-041126|http://digital.lib.uiowa.edu/cdm/ref/collection/duffy/id/133,,,,,,,,,,,,,,,,,,,,,,,,,,,,,,,,,,,,,,,,,,,,,,,,"<a href=""http://digital.lib.uiowa.edu/cdm/ref/collection/duffy/id/133"" target=""_blank"">View this item in its source respository</a>",,,,,,,,,,,,,,,,,,,,,,,,,,,,,https://www.iowaheritage.org/files/original/3dfd3be09766b024a278c42827e95ca8.jpg,"Remote Item","Editorial Cartoons of Brian Duffy",1,0
64294,https://www.iowaheritage.org/items/show/64294,"Not only did I receive a pardon, the increased my feed!","Turkeys|United States|Turkeys|2000-2010|Thanksgiving|Presidents|Tradition|Holidays",,"Duffy, Brian, 1955-",,"University of Iowa. Libraries. Special Collections Dept.",2004-11-25|2011-04,,"Educational use only, no other permissions given. Copyright to this digital object is owned by The Des Moines Register; it may not be downloaded, reproduced, or distributed without written permission. For more information, contact the Special Collections Department.","Editorial Cartoons of Brian Duffy; Des Moines Register Cartoonists|Papers of Brian Duffy|Des Moines Register",,English,"Still image|Editorial cartoons",MSC916|duffy-041125|http://digital.lib.uiowa.edu/cdm/ref/collection/duffy/id/132,,,,,,,,,,,,,,,,,,,,,,,,,,,,,,,,,,,,,,,,,,,,,,,,"<a href=""http://digital.lib.uiowa.edu/cdm/ref/collection/duffy/id/132"" target=""_blank"">View this item in its source respository</a>",,,,,,,,,,,,,,,,,,,,,,,,,,,,,https://www.iowaheritage.org/files/original/4a7e8120a55163e00dc478a8936d6e50.jpg,"Remote Item","Editorial Cartoons of Brian Duffy",1,0
64293,https://www.iowaheritage.org/items/show/64293,"Bumper crop","Universities & colleges|Iowa|Corn|2000-2010|Sports|Football|Championships|Football","Iowa co-Big 10 champs; Iowa State co-Big 12 North champs; Drake PFL champs","Duffy, Brian, 1955-",,"University of Iowa. Libraries. Special Collections Dept.",2004-11-23|2011-04,,"Educational use only, no other permissions given. Copyright to this digital object is owned by The Des Moines Register; it may not be downloaded, reproduced, or distributed without written permission. For more information, contact the Special Collections Department.","Editorial Cartoons of Brian Duffy; Des Moines Register Cartoonists|Papers of Brian Duffy|Des Moines Register",,English,"Still image|Editorial cartoons",MSC916|duffy-041123|http://digital.lib.uiowa.edu/cdm/ref/collection/duffy/id/131,,,,,,,,,,,,,,,,,,,,,,,,,,,,,,,,,,,,,,,,,,,,,,,,"<a href=""http://digital.lib.uiowa.edu/cdm/ref/collection/duffy/id/131"" target=""_blank"">View this item in its source respository</a>",,,,,,,,,,,,,,,,,,,,,,,,,,,,,https://www.iowaheritage.org/files/original/b10b78993e973f782c041259e058eabb.jpg,"Remote Item","Editorial Cartoons of Brian Duffy",1,0
64292,https://www.iowaheritage.org/items/show/64292,"Easy open cap","Medicine|United States|Medicines|2000-2010|Poison|Regulation|Safety|Public safety|Public good|Public confidence|Government regulation|Government|Bottles|Corks|Skull & crossbones","FDA; Potentially unsafe drugs","Duffy, Brian, 1955-",,"University of Iowa. Libraries. Special Collections Dept.",2004-11-21|2011-04,,"Educational use only, no other permissions given. Copyright to this digital object is owned by The Des Moines Register; it may not be downloaded, reproduced, or distributed without written permission. For more information, contact the Special Collections Department.","Editorial Cartoons of Brian Duffy; Des Moines Register Cartoonists|Papers of Brian Duffy|Des Moines Register",,English,"Still image|Editorial cartoons",MSC916|duffy-041121|http://digital.lib.uiowa.edu/cdm/ref/collection/duffy/id/130,,,,,,,,,,,,,,,,,,,,,,,,,,,,,,,,,,,,,,,,,,,,,,,,"<a href=""http://digital.lib.uiowa.edu/cdm/ref/collection/duffy/id/130"" target=""_blank"">View this item in its source respository</a>",,,,,,,,,,,,,,,,,,,,,,,,,,,,,https://www.iowaheritage.org/files/original/5a4df7ef86d03de1a6b7cb10051b8baa.jpg,"Remote Item","Editorial Cartoons of Brian Duffy",1,0
64291,https://www.iowaheritage.org/items/show/64291,"I have not shut the door on 2008","Presidency|Kerry, John, 1943-|United States|Senators|2000-2010|Candidates|Democrats|Democratic Party|Politicians|Politics|Political parties|Nominations for office|Men|Donkeys|Doors",Slam,"Duffy, Brian, 1955-",,"University of Iowa. Libraries. Special Collections Dept.",2004-11-18|2011-04,,"Educational use only, no other permissions given. Copyright to this digital object is owned by The Des Moines Register; it may not be downloaded, reproduced, or distributed without written permission. For more information, contact the Special Collections Department.","Editorial Cartoons of Brian Duffy; Des Moines Register Cartoonists|Papers of Brian Duffy|Des Moines Register",,English,"Still image|Editorial cartoons",MSC916|duffy-041118|http://digital.lib.uiowa.edu/cdm/ref/collection/duffy/id/129,,,,,,,,,,,,,,,,,,,,,,,,,,,,,,,,,,,,,,,,,,,,,,,,"<a href=""http://digital.lib.uiowa.edu/cdm/ref/collection/duffy/id/129"" target=""_blank"">View this item in its source respository</a>",,,,,,,,,,,,,,,,,,,,,,,,,,,,,https://www.iowaheritage.org/files/original/05f7c13630c8f68337bd325d02f76d1f.jpg,"Remote Item","Editorial Cartoons of Brian Duffy",1,0
64290,https://www.iowaheritage.org/items/show/64290,"Birds of a feather, flock together","Cabinets|Rumsfeld, Donald, 1932-|United States|Vultures|2000-2010|Politicians|Political corruption|Political corruption -- United States|Power|Influence|Political influence|Rice, Condoleezza, 1954-|Powell, Colin L.|Cheney, Richard B.|Cabinet officers|Trees|Tree limbs","Those, like Powell, who don't, fly away","Duffy, Brian, 1955-",,"University of Iowa. Libraries. Special Collections Dept.",2004-11-17|2011-04,,"Educational use only, no other permissions given. Copyright to this digital object is owned by The Des Moines Register; it may not be downloaded, reproduced, or distributed without written permission. For more information, contact the Special Collections Department.","Editorial Cartoons of Brian Duffy; Des Moines Register Cartoonists|Papers of Brian Duffy|Des Moines Register",,English,"Still image|Editorial cartoons",MSC916|duffy-041117|http://digital.lib.uiowa.edu/cdm/ref/collection/duffy/id/128,,,,,,,,,,,,,,,,,,,,,,,,,,,,,,,,,,,,,,,,,,,,,,,,"<a href=""http://digital.lib.uiowa.edu/cdm/ref/collection/duffy/id/128"" target=""_blank"">View this item in its source respository</a>",,,,,,,,,,,,,,,,,,,,,,,,,,,,,https://www.iowaheritage.org/files/original/0295f02c1fbfb2685b109929f30c7de5.jpg,"Remote Item","Editorial Cartoons of Brian Duffy",1,0
64289,https://www.iowaheritage.org/items/show/64289,"It'll grow where just about no other crop will","Disasters|United States|Plants|2000-2010|Money|Government|Assistance|Crops|Crop failures|Men|Barns|Money","Great Plains; $; Federal disaster payments","Duffy, Brian, 1955-",,"University of Iowa. Libraries. Special Collections Dept.",2004-11-16|2011-04,,"Educational use only, no other permissions given. Copyright to this digital object is owned by The Des Moines Register; it may not be downloaded, reproduced, or distributed without written permission. For more information, contact the Special Collections Department.","Editorial Cartoons of Brian Duffy; Des Moines Register Cartoonists|Papers of Brian Duffy|Des Moines Register",,English,"Still image|Editorial cartoons",MSC916|duffy-041116|http://digital.lib.uiowa.edu/cdm/ref/collection/duffy/id/127,,,,,,,,,,,,,,,,,,,,,,,,,,,,,,,,,,,,,,,,,,,,,,,,"<a href=""http://digital.lib.uiowa.edu/cdm/ref/collection/duffy/id/127"" target=""_blank"">View this item in its source respository</a>",,,,,,,,,,,,,,,,,,,,,,,,,,,,,https://www.iowaheritage.org/files/original/38a57f1df1dc4f923deb97f8d0105f33.jpg,"Remote Item","Editorial Cartoons of Brian Duffy",1,0
64288,https://www.iowaheritage.org/items/show/64288,"We're supposed to keep an eye out for these people","National security|Iowa|Men|2000-2010|Candidates|Presidents|Presidency|Terrorism|United States|Paper|Policemen","Terrorists, huh?; 2012 presidential candidates; Iowa Homeland Security","Duffy, Brian, 1955-",,"University of Iowa. Libraries. Special Collections Dept.",2004-11-14|2011-04,,"Educational use only, no other permissions given. Copyright to this digital object is owned by The Des Moines Register; it may not be downloaded, reproduced, or distributed without written permission. For more information, contact the Special Collections Department.","Editorial Cartoons of Brian Duffy; Des Moines Register Cartoonists|Papers of Brian Duffy|Des Moines Register",,English,"Still image|Editorial cartoons",MSC916|duffy-041114|http://digital.lib.uiowa.edu/cdm/ref/collection/duffy/id/126,,,,,,,,,,,,,,,,,,,,,,,,,,,,,,,,,,,,,,,,,,,,,,,,"<a href=""http://digital.lib.uiowa.edu/cdm/ref/collection/duffy/id/126"" target=""_blank"">View this item in its source respository</a>",,,,,,,,,,,,,,,,,,,,,,,,,,,,,https://www.iowaheritage.org/files/original/fe456be0b4e1bb99e6f2cecfdf57c9a4.jpg,"Remote Item","Editorial Cartoons of Brian Duffy",1,0
64287,https://www.iowaheritage.org/items/show/64287,"Arafat's footprints","Palestine|Arafat, Yasir, 1929-2004|Palestine|Footprints|2000-2010|Violence|Peace|Occupation|Foreign relations|Conflict|Israel|Signs|Arrows|Doves|Olive branches",Peace,"Duffy, Brian, 1955-",,"University of Iowa. Libraries. Special Collections Dept.",2004-11-12|2011-04,,"Educational use only, no other permissions given. Copyright to this digital object is owned by The Des Moines Register; it may not be downloaded, reproduced, or distributed without written permission. For more information, contact the Special Collections Department.","Editorial Cartoons of Brian Duffy; Des Moines Register Cartoonists|Papers of Brian Duffy|Des Moines Register",,English,"Still image|Editorial cartoons",MSC916|duffy-041112|http://digital.lib.uiowa.edu/cdm/ref/collection/duffy/id/125,,,,,,,,,,,,,,,,,,,,,,,,,,,,,,,,,,,,,,,,,,,,,,,,"<a href=""http://digital.lib.uiowa.edu/cdm/ref/collection/duffy/id/125"" target=""_blank"">View this item in its source respository</a>",,,,,,,,,,,,,,,,,,,,,,,,,,,,,https://www.iowaheritage.org/files/original/f1380c405a269abd162ab225c8caf2a6.jpg,"Remote Item","Editorial Cartoons of Brian Duffy",1,0
64286,https://www.iowaheritage.org/items/show/64286,"Looks like the two of you are going to have to cooperate","Elections|United States|Women|2000-2010|Politics|Political parties|Politicians|Congress|Democrats|Republicans|Donkeys|Elephants",,"Duffy, Brian, 1955-",,"University of Iowa. Libraries. Special Collections Dept.",2004-11-07|2011-04,,"Educational use only, no other permissions given. Copyright to this digital object is owned by The Des Moines Register; it may not be downloaded, reproduced, or distributed without written permission. For more information, contact the Special Collections Department.","Editorial Cartoons of Brian Duffy; Des Moines Register Cartoonists|Papers of Brian Duffy|Des Moines Register",,English,"Still image|Editorial cartoons",MSC916|duffy-041107|http://digital.lib.uiowa.edu/cdm/ref/collection/duffy/id/124,,,,,,,,,,,,,,,,,,,,,,,,,,,,,,,,,,,,,,,,,,,,,,,,"<a href=""http://digital.lib.uiowa.edu/cdm/ref/collection/duffy/id/124"" target=""_blank"">View this item in its source respository</a>",,,,,,,,,,,,,,,,,,,,,,,,,,,,,https://www.iowaheritage.org/files/original/0191d425b02da650f39cd8a394045004.jpg,"Remote Item","Editorial Cartoons of Brian Duffy",1,0
