 




﻿"Item Id","Item URI","Dublin Core:Title","Dublin Core:Subject","Dublin Core:Description","Dublin Core:Creator","Dublin Core:Source","Dublin Core:Publisher","Dublin Core:Date","Dublin Core:Contributor","Dublin Core:Rights","Dublin Core:Relation","Dublin Core:Format","Dublin Core:Language","Dublin Core:Type","Dublin Core:Identifier","Dublin Core:Coverage","Item Type Metadata:Text","Item Type Metadata:Interviewer","Item Type Metadata:Interviewee","Item Type Metadata:Location","Item Type Metadata:Transcription","Item Type Metadata:Local URL","Item Type Metadata:Original Format","Item Type Metadata:Physical Dimensions","Item Type Metadata:Duration","Item Type Metadata:Compression","Item Type Metadata:Producer","Item Type Metadata:Director","Item Type Metadata:Bit Rate/Frequency","Item Type Metadata:Time Summary","Item Type Metadata:Email Body","Item Type Metadata:Subject Line","Item Type Metadata:From","Item Type Metadata:To","Item Type Metadata:CC","Item Type Metadata:BCC","Item Type Metadata:Number of Attachments","Item Type Metadata:Standards","Item Type Metadata:Objectives","Item Type Metadata:Materials","Item Type Metadata:Lesson Plan Text","Item Type Metadata:URL","Item Type Metadata:Event Type","Item Type Metadata:Participants","Item Type Metadata:Birth Date","Item Type Metadata:Birthplace","Item Type Metadata:Death Date","Item Type Metadata:Occupation","Item Type Metadata:Biographical Text","Item Type Metadata:Bibliography","Item Type Metadata:Digital Reproduction Information","Item Type Metadata:Repository","Item Type Metadata:Repository Collection","Item Type Metadata:Contact information.","Item Type Metadata:File Name","Item Type Metadata:Notes","Item Type Metadata:Digital item created","Item Type Metadata:Digital item modified","Item Type Metadata:Executive Orders","Item Type Metadata:Record Created","Item Type Metadata:Record Modified","Item Type Metadata:Transcription2","Item Type Metadata:Source URL","Omeka Legacy File:Additional Creator","Omeka Legacy File:Transcriber","Omeka Legacy File:Producer","Omeka Legacy File:Render Device","Omeka Legacy File:Render Details","Omeka Legacy File:Capture Date","Omeka Legacy File:Capture Device","Omeka Legacy File:Capture Details","Omeka Legacy File:Change History","Omeka Legacy File:Watermark","Omeka Legacy File:Encryption","Omeka Legacy File:Compression","Omeka Legacy File:Post Processing","Omeka Image File:Width","Omeka Image File:Height","Omeka Image File:Bit Depth","Omeka Image File:Channels","Omeka Image File:Exif String","Omeka Image File:Exif Array","Omeka Image File:IPTC String","Omeka Image File:IPTC Array","Omeka Video File:Bitrate","Omeka Video File:Duration","Omeka Video File:Sample Rate","Omeka Video File:Codec","Omeka Video File:Width","Omeka Video File:Height",tags,file,itemType,collection,public,featured
64367,https://www.iowaheritage.org/items/show/64367,"Ptew ...","Football|United States|Bears|1980-1990|Championships|Sports|Chicago (Ill.)|Boston (Mass.)|Football players|Helmets|Hats|Handkerchiefs|Spitting","Patriots; Lunch; 99; C;","Duffy, Brian, 1955-",,"University of Iowa. Libraries. Special Collections Dept.",1986-01-28|2011-04,,"Educational use only, no other permissions given. Copyright to this digital object is owned by The Des Moines Register; it may not be downloaded, reproduced, or distributed without written permission. For more information, contact the Special Collections Department.","Editorial Cartoons of Brian Duffy; Des Moines Register Cartoonists|Papers of Brian Duffy|Des Moines Register",,English,"Still image|Editorial cartoons",MSC916|duffy-860128|http://digital.lib.uiowa.edu/cdm/ref/collection/duffy/id/205,,,,,,,,,,,,,,,,,,,,,,,,,,,,,,,,,,,,,,,,,,,,,,,,"<a href=""http://digital.lib.uiowa.edu/cdm/ref/collection/duffy/id/205"" target=""_blank"">View this item in its source respository</a>",,,,,,,,,,,,,,,,,,,,,,,,,,,,,https://www.iowaheritage.org/files/original/15d51dd8b1b1a438158f4631a572c6e9.jpg,"Remote Item","Editorial Cartoons of Brian Duffy",1,0
64519,https://www.iowaheritage.org/items/show/64519,"Q. What do Ronald Reagan and James Watt have in common?","Presidents|Reagan, Ronald|United States|Presidents|1980-1990|Foreign relations|Foreign policy|United States -- Foreign relations -- Soviet Union|Cold War|Watt, James G., 1938-|Bombs|Men|Arrows","Answer: the same gag writer; Two wild & crazy guys; I am pleased to tell you I just signed legislation which outlaws Russia forever the bombing begins in 5 minutes; ... a black, a woman, two Jews, and a cripple","Duffy, Brian, 1955-",,"University of Iowa. Libraries. Special Collections Dept.",1984-08-16|2011-04,,"Educational use only, no other permissions given. Copyright to this digital object is owned by The Des Moines Register; it may not be downloaded, reproduced, or distributed without written permission. For more information, contact the Special Collections Department.","Editorial Cartoons of Brian Duffy; Des Moines Register Cartoonists|Papers of Brian Duffy|Des Moines Register",,English,"Still image|Editorial cartoons",MSC916|duffy-840816|http://digital.lib.uiowa.edu/cdm/ref/collection/duffy/id/357,,,,,,,,,,,,,,,,,,,,,,,,,,,,,,,,,,,,,,,,,,,,,,,,"<a href=""http://digital.lib.uiowa.edu/cdm/ref/collection/duffy/id/357"" target=""_blank"">View this item in its source respository</a>",,,,,,,,,,,,,,,,,,,,,,,,,,,,,https://www.iowaheritage.org/files/original/6921c9bf1796a83c478dbb3702910753.jpg,"Remote Item","Editorial Cartoons of Brian Duffy",1,0
64588,https://www.iowaheritage.org/items/show/64588,"Quit complaining, John, you want to be confirmed, don't you?","Presidents|Tower, John G. (John Goodwin), 1925-1991|Washington (D.C.)|Presidents|1980-1990|Nominations for office|Political appointments|Politicians|Bush, George, 1924-|Monks|Monuments|Buildings|Clouds","Vows; J. Tower","Duffy, Brian, 1955-",,"University of Iowa. Libraries. Special Collections Dept.",1989-05|2011-04,,"Educational use only, no other permissions given. Copyright to this digital object is owned by The Des Moines Register; it may not be downloaded, reproduced, or distributed without written permission. For more information, contact the Special Collections Department.","Editorial Cartoons of Brian Duffy; Des Moines Register Cartoonists|Papers of Brian Duffy|Des Moines Register",,English,"Still image|Editorial cartoons","MSC916|duffy-8905xx 4|http://digital.lib.uiowa.edu/cdm/ref/collection/duffy/id/426",,,,,,,,,,,,,,,,,,,,,,,,,,,,,,,,,,,,,,,,,,,,,,,,"<a href=""http://digital.lib.uiowa.edu/cdm/ref/collection/duffy/id/426"" target=""_blank"">View this item in its source respository</a>",,,,,,,,,,,,,,,,,,,,,,,,,,,,,https://www.iowaheritage.org/files/original/49a9ad2e6938101319524d34426cf0ce.jpg,"Remote Item","Editorial Cartoons of Brian Duffy",1,0
64313,https://www.iowaheritage.org/items/show/64313,"RAGBRAI XXXVI Missouri Valley Harlan Jefferson Ames Tama/Toledo North Liberty Tipton Le Claire","Bicycling|Iowa|RAGBRAI (Bicycle race)|Bicycles|2000-2010|Cycling|Geography|Sun|Men|Corn|Hills|Highways|Shirts|Roads|Helmets|Safety equipment|Cyclists",,"Duffy, Brian, 1955-",,"University of Iowa. Libraries. Special Collections Dept.",2008-07-20|2011-04,,"Educational use only, no other permissions given. Copyright to this digital object is owned by The Des Moines Register; it may not be downloaded, reproduced, or distributed without written permission. For more information, contact the Special Collections Department.","Editorial Cartoons of Brian Duffy; Des Moines Register Cartoonists|Papers of Brian Duffy|Des Moines Register",,English,"Still image|Editorial cartoons",MSC916|duffy-080720|http://digital.lib.uiowa.edu/cdm/ref/collection/duffy/id/151,,,,,,,,,,,,,,,,,,,,,,,,,,,,,,,,,,,,,,,,,,,,,,,,"<a href=""http://digital.lib.uiowa.edu/cdm/ref/collection/duffy/id/151"" target=""_blank"">View this item in its source respository</a>",,,,,,,,,,,,,,,,,,,,,,,,,,,,,https://www.iowaheritage.org/files/original/7a5fcf6f9dba7e25f3becef66e5eafe5.jpg,"Remote Item","Editorial Cartoons of Brian Duffy",1,0
64625,https://www.iowaheritage.org/items/show/64625,"Re-elect ""Bill"" Incumbent","Voters|United States|Signs|1990-2000|Votes|Voting|Polls|Politicians|Election Day|Elections|Elections -- United States|Polling places|Politicians|Voters|Levers|Guillotines",,"Duffy, Brian, 1955-",,"University of Iowa. Libraries. Special Collections Dept.",1990-08|2011-04,,"Educational use only, no other permissions given. Copyright to this digital object is owned by The Des Moines Register; it may not be downloaded, reproduced, or distributed without written permission. For more information, contact the Special Collections Department.","Editorial Cartoons of Brian Duffy; Des Moines Register Cartoonists|Papers of Brian Duffy|Des Moines Register",,English,"Still image|Editorial cartoons","MSC916|duffy-9008xx 5|http://digital.lib.uiowa.edu/cdm/ref/collection/duffy/id/463",,,,,,,,,,,,,,,,,,,,,,,,,,,,,,,,,,,,,,,,,,,,,,,,"<a href=""http://digital.lib.uiowa.edu/cdm/ref/collection/duffy/id/463"" target=""_blank"">View this item in its source respository</a>",,,,,,,,,,,,,,,,,,,,,,,,,,,,,https://www.iowaheritage.org/files/original/857a4804f1d28d153f1e2a198a5ccf67.jpg,"Remote Item","Editorial Cartoons of Brian Duffy",1,0
64369,https://www.iowaheritage.org/items/show/64369,"Re-organization minefield","Democrats|United States|Signs|1980-1990|Political parties|Politicians|Politics|Reorganization|Power|Arrows|Donkeys","You are here!","Duffy, Brian, 1955-",,"University of Iowa. Libraries. Special Collections Dept.",1986-01|2011-04,,"Educational use only, no other permissions given. Copyright to this digital object is owned by The Des Moines Register; it may not be downloaded, reproduced, or distributed without written permission. For more information, contact the Special Collections Department.","Editorial Cartoons of Brian Duffy; Des Moines Register Cartoonists|Papers of Brian Duffy|Des Moines Register",,English,"Still image|Editorial cartoons","MSC916|duffy-8601xx-undated 1|http://digital.lib.uiowa.edu/cdm/ref/collection/duffy/id/207",,,,,,,,,,,,,,,,,,,,,,,,,,,,,,,,,,,,,,,,,,,,,,,,"<a href=""http://digital.lib.uiowa.edu/cdm/ref/collection/duffy/id/207"" target=""_blank"">View this item in its source respository</a>",,,,,,,,,,,,,,,,,,,,,,,,,,,,,https://www.iowaheritage.org/files/original/6cb270c0aa509ecdc52b585374929ff3.jpg,"Remote Item","Editorial Cartoons of Brian Duffy",1,0
64306,https://www.iowaheritage.org/items/show/64306,"Reach out","Floods|Iowa|Living rooms|2000-2010|Flood relief|Disasters, natural|Recovery|Reconstruction|Housing|Women|Boots|Hands|Water|Floods|Books|Televisions|Couches|Masks|Safety equipment","Embrace Iowa; Photo album","Duffy, Brian, 1955-",,"University of Iowa. Libraries. Special Collections Dept.",2008-06-29|2011-04,,"Educational use only, no other permissions given. Copyright to this digital object is owned by The Des Moines Register; it may not be downloaded, reproduced, or distributed without written permission. For more information, contact the Special Collections Department.","Editorial Cartoons of Brian Duffy; Des Moines Register Cartoonists|Papers of Brian Duffy|Des Moines Register",,English,"Still image|Editorial cartoons",MSC916|duffy-080629|http://digital.lib.uiowa.edu/cdm/ref/collection/duffy/id/144,,,,,,,,,,,,,,,,,,,,,,,,,,,,,,,,,,,,,,,,,,,,,,,,"<a href=""http://digital.lib.uiowa.edu/cdm/ref/collection/duffy/id/144"" target=""_blank"">View this item in its source respository</a>",,,,,,,,,,,,,,,,,,,,,,,,,,,,,https://www.iowaheritage.org/files/original/ad9269db23effbb77d0e018d6239d737.jpg,"Remote Item","Editorial Cartoons of Brian Duffy",1,0
64678,https://www.iowaheritage.org/items/show/64678,"Record crop","Corn|United States|Corn|1990-2000|Crops|Surplus|Surplus agricultural commodities|Farmers|Farming|Farmers|Farms|Barns|Launches|Running",,"Duffy, Brian, 1955-",,"University of Iowa. Libraries. Special Collections Dept.",1992-11-19|2011-04,,"Educational use only, no other permissions given. Copyright to this digital object is owned by The Des Moines Register; it may not be downloaded, reproduced, or distributed without written permission. For more information, contact the Special Collections Department.","Editorial Cartoons of Brian Duffy; Des Moines Register Cartoonists|Papers of Brian Duffy|Des Moines Register",,English,"Still image|Editorial cartoons",MSC916|duffy-921119|http://digital.lib.uiowa.edu/cdm/ref/collection/duffy/id/516,,,,,,,,,,,,,,,,,,,,,,,,,,,,,,,,,,,,,,,,,,,,,,,,"<a href=""http://digital.lib.uiowa.edu/cdm/ref/collection/duffy/id/516"" target=""_blank"">View this item in its source respository</a>",,,,,,,,,,,,,,,,,,,,,,,,,,,,,https://www.iowaheritage.org/files/original/a1101b728ef4880a1f0b986630a0352d.jpg,"Remote Item","Editorial Cartoons of Brian Duffy",1,0
64505,https://www.iowaheritage.org/items/show/64505,"Record farm income","Government|Block, John R.|United States|Skulls|1980-1990|Leadership|Agriculture|Agriculture and state|Agriculture -- Economic aspects|Farms|Cactus|Deserts|Farmers|Men|Mirages","I think Mr. Block has been out in the sun too long","Duffy, Brian, 1955-",,"University of Iowa. Libraries. Special Collections Dept.",1984-08-01|2011-04,,"Educational use only, no other permissions given. Copyright to this digital object is owned by The Des Moines Register; it may not be downloaded, reproduced, or distributed without written permission. For more information, contact the Special Collections Department.","Editorial Cartoons of Brian Duffy; Des Moines Register Cartoonists|Papers of Brian Duffy|Des Moines Register",,English,"Still image|Editorial cartoons",MSC916|duffy-840801|http://digital.lib.uiowa.edu/cdm/ref/collection/duffy/id/343,,,,,,,,,,,,,,,,,,,,,,,,,,,,,,,,,,,,,,,,,,,,,,,,"<a href=""http://digital.lib.uiowa.edu/cdm/ref/collection/duffy/id/343"" target=""_blank"">View this item in its source respository</a>",,,,,,,,,,,,,,,,,,,,,,,,,,,,,https://www.iowaheritage.org/files/original/6b565b8580aceb011ee5eaae2447d3cb.jpg,"Remote Item","Editorial Cartoons of Brian Duffy",1,0
64416,https://www.iowaheritage.org/items/show/64416,"Red ink","Governors|Branstad, Terry E.|Iowa|Governors|1990-2000|Budgets|States|State governments|Spending|Government|Government spending|Government spending policy|Deficits|Doors|Doorknobs|Buckets|Paints & varnishes|Podiums|Microphones|Books|Press conferences","Budget; Seal of the","Duffy, Brian, 1955-",,"University of Iowa. Libraries. Special Collections Dept.",1991-01-23|2011-04,,"Educational use only, no other permissions given. Copyright to this digital object is owned by The Des Moines Register; it may not be downloaded, reproduced, or distributed without written permission. For more information, contact the Special Collections Department.","Editorial Cartoons of Brian Duffy; Des Moines Register Cartoonists|Papers of Brian Duffy|Des Moines Register",,English,"Still image|Editorial cartoons",MSC916|duffy-910123|http://digital.lib.uiowa.edu/cdm/ref/collection/duffy/id/254,,,,,,,,,,,,,,,,,,,,,,,,,,,,,,,,,,,,,,,,,,,,,,,,"<a href=""http://digital.lib.uiowa.edu/cdm/ref/collection/duffy/id/254"" target=""_blank"">View this item in its source respository</a>",,,,,,,,,,,,,,,,,,,,,,,,,,,,,https://www.iowaheritage.org/files/original/11a8fe7f735263344adf934ed62a5de0.jpg,"Remote Item","Editorial Cartoons of Brian Duffy",1,0
