 




﻿"Item Id","Item URI","Dublin Core:Title","Dublin Core:Subject","Dublin Core:Description","Dublin Core:Creator","Dublin Core:Source","Dublin Core:Publisher","Dublin Core:Date","Dublin Core:Contributor","Dublin Core:Rights","Dublin Core:Relation","Dublin Core:Format","Dublin Core:Language","Dublin Core:Type","Dublin Core:Identifier","Dublin Core:Coverage","Item Type Metadata:Text","Item Type Metadata:Interviewer","Item Type Metadata:Interviewee","Item Type Metadata:Location","Item Type Metadata:Transcription","Item Type Metadata:Local URL","Item Type Metadata:Original Format","Item Type Metadata:Physical Dimensions","Item Type Metadata:Duration","Item Type Metadata:Compression","Item Type Metadata:Producer","Item Type Metadata:Director","Item Type Metadata:Bit Rate/Frequency","Item Type Metadata:Time Summary","Item Type Metadata:Email Body","Item Type Metadata:Subject Line","Item Type Metadata:From","Item Type Metadata:To","Item Type Metadata:CC","Item Type Metadata:BCC","Item Type Metadata:Number of Attachments","Item Type Metadata:Standards","Item Type Metadata:Objectives","Item Type Metadata:Materials","Item Type Metadata:Lesson Plan Text","Item Type Metadata:URL","Item Type Metadata:Event Type","Item Type Metadata:Participants","Item Type Metadata:Birth Date","Item Type Metadata:Birthplace","Item Type Metadata:Death Date","Item Type Metadata:Occupation","Item Type Metadata:Biographical Text","Item Type Metadata:Bibliography","Item Type Metadata:Digital Reproduction Information","Item Type Metadata:Repository","Item Type Metadata:Repository Collection","Item Type Metadata:Contact information.","Item Type Metadata:File Name","Item Type Metadata:Notes","Item Type Metadata:Digital item created","Item Type Metadata:Digital item modified","Item Type Metadata:Executive Orders","Item Type Metadata:Record Created","Item Type Metadata:Record Modified","Item Type Metadata:Transcription2","Item Type Metadata:Source URL","Omeka Legacy File:Additional Creator","Omeka Legacy File:Transcriber","Omeka Legacy File:Producer","Omeka Legacy File:Render Device","Omeka Legacy File:Render Details","Omeka Legacy File:Capture Date","Omeka Legacy File:Capture Device","Omeka Legacy File:Capture Details","Omeka Legacy File:Change History","Omeka Legacy File:Watermark","Omeka Legacy File:Encryption","Omeka Legacy File:Compression","Omeka Legacy File:Post Processing","Omeka Image File:Width","Omeka Image File:Height","Omeka Image File:Bit Depth","Omeka Image File:Channels","Omeka Image File:Exif String","Omeka Image File:Exif Array","Omeka Image File:IPTC String","Omeka Image File:IPTC Array","Omeka Video File:Bitrate","Omeka Video File:Duration","Omeka Video File:Sample Rate","Omeka Video File:Codec","Omeka Video File:Width","Omeka Video File:Height",tags,file,itemType,collection,public,featured
64352,https://www.iowaheritage.org/items/show/64352,"We're right behind you old boy!","Presidents|Reagan, Ronald|United States|Presidents|1980-1990|Dictatorships|Economic sanctions|United States -- Foreign relations|United States -- Foreign economic relations|United States -- Foreign relations -- Libya|Great Britain|Western Europe|Germany|France|Libya|Leaders|Guns|Men|Caves|Skulls|Hunters|Hunting","Ja!; Oui!; Western Europe; Libya; Sanctions","Duffy, Brian, 1955-",,"University of Iowa. Libraries. Special Collections Dept.",1986-01-05|2011-04,,"Educational use only, no other permissions given. Copyright to this digital object is owned by The Des Moines Register; it may not be downloaded, reproduced, or distributed without written permission. For more information, contact the Special Collections Department.","Editorial Cartoons of Brian Duffy; Des Moines Register Cartoonists|Papers of Brian Duffy|Des Moines Register",,English,"Still image|Editorial cartoons",MSC916|duffy-860105|http://digital.lib.uiowa.edu/cdm/ref/collection/duffy/id/190,,,,,,,,,,,,,,,,,,,,,,,,,,,,,,,,,,,,,,,,,,,,,,,,"<a href=""http://digital.lib.uiowa.edu/cdm/ref/collection/duffy/id/190"" target=""_blank"">View this item in its source respository</a>",,,,,,,,,,,,,,,,,,,,,,,,,,,,,https://www.iowaheritage.org/files/original/53c9659ea35e79444b01c696355b3086.jpg,"Remote Item","Editorial Cartoons of Brian Duffy",1,0
64353,https://www.iowaheritage.org/items/show/64353,"South Africa","Apartheid|South Africa|Tanks|1980-1990|Government|Government, Resistance to|Racism|Racial discrimination|Race relations|Race riots|Prejudice|Economic & political systems|Segregation|Violence|Men|Soldiers|Guns|Trucks|Mines (Weapons)",Apartheid,"Duffy, Brian, 1955-",,"University of Iowa. Libraries. Special Collections Dept.",1986-01-08|2011-04,,"Educational use only, no other permissions given. Copyright to this digital object is owned by The Des Moines Register; it may not be downloaded, reproduced, or distributed without written permission. For more information, contact the Special Collections Department.","Editorial Cartoons of Brian Duffy; Des Moines Register Cartoonists|Papers of Brian Duffy|Des Moines Register",,English,"Still image|Editorial cartoons",MSC916|duffy-860108|http://digital.lib.uiowa.edu/cdm/ref/collection/duffy/id/191,,,,,,,,,,,,,,,,,,,,,,,,,,,,,,,,,,,,,,,,,,,,,,,,"<a href=""http://digital.lib.uiowa.edu/cdm/ref/collection/duffy/id/191"" target=""_blank"">View this item in its source respository</a>",,,,,,,,,,,,,,,,,,,,,,,,,,,,,https://www.iowaheritage.org/files/original/aaa8f30b78ecfe7aa83837a0f9d64c42.jpg,"Remote Item","Editorial Cartoons of Brian Duffy",1,0
64354,https://www.iowaheritage.org/items/show/64354,"Kick me","Presidents|Block, John R.|United States|Roads|1980-1990|Presidential appointees|Agriculture|Agriculture and state|Cabinets|Farm aid|Farming|Farms|Men|Pigs|Moon|Houses|Trees|Clouds",Block,"Duffy, Brian, 1955-",,"University of Iowa. Libraries. Special Collections Dept.",1986-01-10|2011-04,,"Educational use only, no other permissions given. Copyright to this digital object is owned by The Des Moines Register; it may not be downloaded, reproduced, or distributed without written permission. For more information, contact the Special Collections Department.","Editorial Cartoons of Brian Duffy; Des Moines Register Cartoonists|Papers of Brian Duffy|Des Moines Register",,English,"Still image|Editorial cartoons",MSC916|duffy-860110|http://digital.lib.uiowa.edu/cdm/ref/collection/duffy/id/192,,,,,,,,,,,,,,,,,,,,,,,,,,,,,,,,,,,,,,,,,,,,,,,,"<a href=""http://digital.lib.uiowa.edu/cdm/ref/collection/duffy/id/192"" target=""_blank"">View this item in its source respository</a>",,,,,,,,,,,,,,,,,,,,,,,,,,,,,https://www.iowaheritage.org/files/original/4e026a9e83ef973c1aa04d26078aa913.jpg,"Remote Item","Editorial Cartoons of Brian Duffy",1,0
64355,https://www.iowaheritage.org/items/show/64355,"Gee, all I said was, who wants to be my new Secretary of Agriculture?","Presidents|Reagan, Ronald|United States|Presidents|1980-1990|Presidential appointees|Agriculture|Agriculture and state|Cabinets|Farm aid|Farming|Farms|Block, John R.|Cowboys|Saddles|Brands|Men|Running",RR,"Duffy, Brian, 1955-",,"University of Iowa. Libraries. Special Collections Dept.",1986-01-12|2011-04,,"Educational use only, no other permissions given. Copyright to this digital object is owned by The Des Moines Register; it may not be downloaded, reproduced, or distributed without written permission. For more information, contact the Special Collections Department.","Editorial Cartoons of Brian Duffy; Des Moines Register Cartoonists|Papers of Brian Duffy|Des Moines Register",,English,"Still image|Editorial cartoons",MSC916|duffy-860112(2)|http://digital.lib.uiowa.edu/cdm/ref/collection/duffy/id/193,,,,,,,,,,,,,,,,,,,,,,,,,,,,,,,,,,,,,,,,,,,,,,,,"<a href=""http://digital.lib.uiowa.edu/cdm/ref/collection/duffy/id/193"" target=""_blank"">View this item in its source respository</a>",,,,,,,,,,,,,,,,,,,,,,,,,,,,,https://www.iowaheritage.org/files/original/1602dd4713fbc02cb2b72493bab2f9bc.jpg,"Remote Item","Editorial Cartoons of Brian Duffy",1,0
64356,https://www.iowaheritage.org/items/show/64356,Terrorism,Terrorism|Earth|Earth|1980-1990|Violence|Hate|Hatred|Dictatorships|Libya|Ireland|Palestine|Iran|Spiders|Spiderwebs|Cobwebs|Planets|Grenades,"IRA; Libya; Iran; PLO","Duffy, Brian, 1955-",,"University of Iowa. Libraries. Special Collections Dept.",1986-01-12|2011-04,,"Educational use only, no other permissions given. Copyright to this digital object is owned by The Des Moines Register; it may not be downloaded, reproduced, or distributed without written permission. For more information, contact the Special Collections Department.","Editorial Cartoons of Brian Duffy; Des Moines Register Cartoonists|Papers of Brian Duffy|Des Moines Register",,English,"Still image|Editorial cartoons",MSC916|duffy-860112|http://digital.lib.uiowa.edu/cdm/ref/collection/duffy/id/194,,,,,,,,,,,,,,,,,,,,,,,,,,,,,,,,,,,,,,,,,,,,,,,,"<a href=""http://digital.lib.uiowa.edu/cdm/ref/collection/duffy/id/194"" target=""_blank"">View this item in its source respository</a>",,,,,,,,,,,,,,,,,,,,,,,,,,,,,https://www.iowaheritage.org/files/original/f11cc67c04b3b4f92ee9b4a1337d74c1.jpg,"Remote Item","Editorial Cartoons of Brian Duffy",1,0
64357,https://www.iowaheritage.org/items/show/64357,"Answers for the 80's","Press|United States|Men|1980-1990|Media influence|Issues|Podiums|Microphones|Signs|Speeches",,"Duffy, Brian, 1955-",,"University of Iowa. Libraries. Special Collections Dept.",1986-01-13|2011-04,,"Educational use only, no other permissions given. Copyright to this digital object is owned by The Des Moines Register; it may not be downloaded, reproduced, or distributed without written permission. For more information, contact the Special Collections Department.","Editorial Cartoons of Brian Duffy; Des Moines Register Cartoonists|Papers of Brian Duffy|Des Moines Register",,English,"Still image|Editorial cartoons",MSC916|duffy-860113|http://digital.lib.uiowa.edu/cdm/ref/collection/duffy/id/195,,,,,,,,,,,,,,,,,,,,,,,,,,,,,,,,,,,,,,,,,,,,,,,,"<a href=""http://digital.lib.uiowa.edu/cdm/ref/collection/duffy/id/195"" target=""_blank"">View this item in its source respository</a>",,,,,,,,,,,,,,,,,,,,,,,,,,,,,https://www.iowaheritage.org/files/original/425445141a0c2e8d1e872ab762bba04b.jpg,"Remote Item","Editorial Cartoons of Brian Duffy",1,0
64358,https://www.iowaheritage.org/items/show/64358,"He huffed, and puffed, and blew the imperialist Zionists off the face of the Earth!","Dictators|Qaddafi, Muammar|Libya|Dictators|1980-1990|Dictatorships|Terrorism|Violence|Hatred|Hate|Antisemitism|Men|Terrorists|Tanks|Grenades|Boys|Baseball gloves|Uniforms|Turbans|Tents|Camels|Antennas (Electronics)","I brake for terrorists; a drive in the country; reading bedtime stories; Family life with Moammar; playing catch","Duffy, Brian, 1955-",,"University of Iowa. Libraries. Special Collections Dept.",1986-01-14|2011-04,,"Educational use only, no other permissions given. Copyright to this digital object is owned by The Des Moines Register; it may not be downloaded, reproduced, or distributed without written permission. For more information, contact the Special Collections Department.","Editorial Cartoons of Brian Duffy; Des Moines Register Cartoonists|Papers of Brian Duffy|Des Moines Register",,English,"Still image|Editorial cartoons",MSC916|duffy-860114(2)|http://digital.lib.uiowa.edu/cdm/ref/collection/duffy/id/196,,,,,,,,,,,,,,,,,,,,,,,,,,,,,,,,,,,,,,,,,,,,,,,,"<a href=""http://digital.lib.uiowa.edu/cdm/ref/collection/duffy/id/196"" target=""_blank"">View this item in its source respository</a>",,,,,,,,,,,,,,,,,,,,,,,,,,,,,https://www.iowaheritage.org/files/original/71009efda30b646b092cce116da177d8.jpg,"Remote Item","Editorial Cartoons of Brian Duffy",1,0
64359,https://www.iowaheritage.org/items/show/64359,"The state of the state","Governors|Branstad, Terry E.|Iowa|Governors|1980-1990|States|State governments|Democrats|Republicans|Partisanship|Parties|Party lines|Political parties|Politicians|Politics|Podiums|Speeches|Men|Fingers|Portraits|Papers",Democrats,"Duffy, Brian, 1955-",,"University of Iowa. Libraries. Special Collections Dept.",1986-01-14|2011-04,,"Educational use only, no other permissions given. Copyright to this digital object is owned by The Des Moines Register; it may not be downloaded, reproduced, or distributed without written permission. For more information, contact the Special Collections Department.","Editorial Cartoons of Brian Duffy; Des Moines Register Cartoonists|Papers of Brian Duffy|Des Moines Register",,English,"Still image|Editorial cartoons",MSC916|duffy-860114|http://digital.lib.uiowa.edu/cdm/ref/collection/duffy/id/197,,,,,,,,,,,,,,,,,,,,,,,,,,,,,,,,,,,,,,,,,,,,,,,,"<a href=""http://digital.lib.uiowa.edu/cdm/ref/collection/duffy/id/197"" target=""_blank"">View this item in its source respository</a>",,,,,,,,,,,,,,,,,,,,,,,,,,,,,https://www.iowaheritage.org/files/original/236cda54b518618dd3cbe26d25bf1637.jpg,"Remote Item","Editorial Cartoons of Brian Duffy",1,0
64360,https://www.iowaheritage.org/items/show/64360,"Horn of plenty","Debt|Iowa|Cornucopias|1980-1990|Farms|Foreclosures|Farmland|Land prices|Economy|Papers|Paper","Debt; Farm foreclosures; Decreased land values","Duffy, Brian, 1955-",,"University of Iowa. Libraries. Special Collections Dept.",1986-01-16|2011-04,,"Educational use only, no other permissions given. Copyright to this digital object is owned by The Des Moines Register; it may not be downloaded, reproduced, or distributed without written permission. For more information, contact the Special Collections Department.","Editorial Cartoons of Brian Duffy; Des Moines Register Cartoonists|Papers of Brian Duffy|Des Moines Register",,English,"Still image|Editorial cartoons",MSC916|duffy-860116|http://digital.lib.uiowa.edu/cdm/ref/collection/duffy/id/198,,,,,,,,,,,,,,,,,,,,,,,,,,,,,,,,,,,,,,,,,,,,,,,,"<a href=""http://digital.lib.uiowa.edu/cdm/ref/collection/duffy/id/198"" target=""_blank"">View this item in its source respository</a>",,,,,,,,,,,,,,,,,,,,,,,,,,,,,https://www.iowaheritage.org/files/original/6e6321c559e849ab33208bf499a39280.jpg,"Remote Item","Editorial Cartoons of Brian Duffy",1,0
64361,https://www.iowaheritage.org/items/show/64361,"Star wars","War|United States|Artificial satellites|1980-1990|Cold War|United States -- Foreign relations -- Soviet Union|Soviet Union -- Foreign relations|Space race|Disarmament|Soviet Union|Earth satellites|Flies|Flypaper|Space flight","Buzz ... ; Soviet disarmament proposals; Flypaper","Duffy, Brian, 1955-",,"University of Iowa. Libraries. Special Collections Dept.",1986-01-17|2011-04,,"Educational use only, no other permissions given. Copyright to this digital object is owned by The Des Moines Register; it may not be downloaded, reproduced, or distributed without written permission. For more information, contact the Special Collections Department.","Editorial Cartoons of Brian Duffy; Des Moines Register Cartoonists|Papers of Brian Duffy|Des Moines Register",,English,"Still image|Editorial cartoons",MSC916|duffy-860117|http://digital.lib.uiowa.edu/cdm/ref/collection/duffy/id/199,,,,,,,,,,,,,,,,,,,,,,,,,,,,,,,,,,,,,,,,,,,,,,,,"<a href=""http://digital.lib.uiowa.edu/cdm/ref/collection/duffy/id/199"" target=""_blank"">View this item in its source respository</a>",,,,,,,,,,,,,,,,,,,,,,,,,,,,,https://www.iowaheritage.org/files/original/d58ef60e93951a9a82bfb78985a378ca.jpg,"Remote Item","Editorial Cartoons of Brian Duffy",1,0
