 




﻿"Item Id","Item URI","Dublin Core:Title","Dublin Core:Subject","Dublin Core:Description","Dublin Core:Creator","Dublin Core:Source","Dublin Core:Publisher","Dublin Core:Date","Dublin Core:Contributor","Dublin Core:Rights","Dublin Core:Relation","Dublin Core:Format","Dublin Core:Language","Dublin Core:Type","Dublin Core:Identifier","Dublin Core:Coverage","Item Type Metadata:Text","Item Type Metadata:Interviewer","Item Type Metadata:Interviewee","Item Type Metadata:Location","Item Type Metadata:Transcription","Item Type Metadata:Local URL","Item Type Metadata:Original Format","Item Type Metadata:Physical Dimensions","Item Type Metadata:Duration","Item Type Metadata:Compression","Item Type Metadata:Producer","Item Type Metadata:Director","Item Type Metadata:Bit Rate/Frequency","Item Type Metadata:Time Summary","Item Type Metadata:Email Body","Item Type Metadata:Subject Line","Item Type Metadata:From","Item Type Metadata:To","Item Type Metadata:CC","Item Type Metadata:BCC","Item Type Metadata:Number of Attachments","Item Type Metadata:Standards","Item Type Metadata:Objectives","Item Type Metadata:Materials","Item Type Metadata:Lesson Plan Text","Item Type Metadata:URL","Item Type Metadata:Event Type","Item Type Metadata:Participants","Item Type Metadata:Birth Date","Item Type Metadata:Birthplace","Item Type Metadata:Death Date","Item Type Metadata:Occupation","Item Type Metadata:Biographical Text","Item Type Metadata:Bibliography","Item Type Metadata:Digital Reproduction Information","Item Type Metadata:Repository","Item Type Metadata:Repository Collection","Item Type Metadata:Contact information.","Item Type Metadata:File Name","Item Type Metadata:Notes","Item Type Metadata:Digital item created","Item Type Metadata:Digital item modified","Item Type Metadata:Executive Orders","Item Type Metadata:Record Created","Item Type Metadata:Record Modified","Item Type Metadata:Transcription2","Item Type Metadata:Source URL","Omeka Legacy File:Additional Creator","Omeka Legacy File:Transcriber","Omeka Legacy File:Producer","Omeka Legacy File:Render Device","Omeka Legacy File:Render Details","Omeka Legacy File:Capture Date","Omeka Legacy File:Capture Device","Omeka Legacy File:Capture Details","Omeka Legacy File:Change History","Omeka Legacy File:Watermark","Omeka Legacy File:Encryption","Omeka Legacy File:Compression","Omeka Legacy File:Post Processing","Omeka Image File:Width","Omeka Image File:Height","Omeka Image File:Bit Depth","Omeka Image File:Channels","Omeka Image File:Exif String","Omeka Image File:Exif Array","Omeka Image File:IPTC String","Omeka Image File:IPTC Array","Omeka Video File:Bitrate","Omeka Video File:Duration","Omeka Video File:Sample Rate","Omeka Video File:Codec","Omeka Video File:Width","Omeka Video File:Height",tags,file,itemType,collection,public,featured
64603,https://www.iowaheritage.org/items/show/64603,"This is a hijacking! ... take me to Marlboro country!","Smoking|United States|Airplanes|1990-2000|Airplanes|Airplanes -- Flights|Airlines|Pilots|Clouds|Cigarettes",,"Duffy, Brian, 1955-",,"University of Iowa. Libraries. Special Collections Dept.",1990-03-04|2011-04,,"Educational use only, no other permissions given. Copyright to this digital object is owned by The Des Moines Register; it may not be downloaded, reproduced, or distributed without written permission. For more information, contact the Special Collections Department.","Editorial Cartoons of Brian Duffy; Des Moines Register Cartoonists|Papers of Brian Duffy|Des Moines Register",,English,"Still image|Editorial cartoons",MSC916|duffy-900304|http://digital.lib.uiowa.edu/cdm/ref/collection/duffy/id/441,,,,,,,,,,,,,,,,,,,,,,,,,,,,,,,,,,,,,,,,,,,,,,,,"<a href=""http://digital.lib.uiowa.edu/cdm/ref/collection/duffy/id/441"" target=""_blank"">View this item in its source respository</a>",,,,,,,,,,,,,,,,,,,,,,,,,,,,,https://www.iowaheritage.org/files/original/a938f3bb4ed16fde659da348350ccf43.jpg,"Remote Item","Editorial Cartoons of Brian Duffy",1,0
64435,https://www.iowaheritage.org/items/show/64435,"This is 911 ... I'm sorry, but all available police officers have been called to a disturbance in the Persian Gulf ...","Violence|Gorbachev, Mikhail Sergeevich, 1931-|Alleys|1990-2000|War|Foreign relations|Aggression|Abuse|Zhang, Zemin|Telephones|Presidents|Men|Women|Leaders|Fighting|Garbage cans|Stars|Purses|Briefcases|Shoes|Bottles","Phone; Baltics; Chinese dissidents","Duffy, Brian, 1955-",,"University of Iowa. Libraries. Special Collections Dept.",1991-02-13|2011-04,,"Educational use only, no other permissions given. Copyright to this digital object is owned by The Des Moines Register; it may not be downloaded, reproduced, or distributed without written permission. For more information, contact the Special Collections Department.","Editorial Cartoons of Brian Duffy; Des Moines Register Cartoonists|Papers of Brian Duffy|Des Moines Register",,English,"Still image|Editorial cartoons",MSC916|duffy-910213|http://digital.lib.uiowa.edu/cdm/ref/collection/duffy/id/273,,,,,,,,,,,,,,,,,,,,,,,,,,,,,,,,,,,,,,,,,,,,,,,,"<a href=""http://digital.lib.uiowa.edu/cdm/ref/collection/duffy/id/273"" target=""_blank"">View this item in its source respository</a>",,,,,,,,,,,,,,,,,,,,,,,,,,,,,https://www.iowaheritage.org/files/original/a137bd76d4cb60dae096facd8716648e.jpg,"Remote Item","Editorial Cartoons of Brian Duffy",1,0
64207,https://www.iowaheritage.org/items/show/64207,"This hill seems to get steeper all the time","Universities & colleges|Iowa|Students|2000-2010|State governments|States|Budgets|Education and state|Education|Universities & colleges|Books|Bags|Hills|Sweating|Tongues","State colleges; Budget cuts; Tuition increases","Duffy, Brian, 1955-",,"University of Iowa. Libraries. Special Collections Dept.",2001-09-30|2011-04,,"Educational use only, no other permissions given. Copyright to this digital object is owned by The Des Moines Register; it may not be downloaded, reproduced, or distributed without written permission. For more information, contact the Special Collections Department.","Editorial Cartoons of Brian Duffy; Des Moines Register Cartoonists|Papers of Brian Duffy|Des Moines Register",,English,"Still image|Editorial cartoons",MSC916|duffy-010930|http://digital.lib.uiowa.edu/cdm/ref/collection/duffy/id/45,,,,,,,,,,,,,,,,,,,,,,,,,,,,,,,,,,,,,,,,,,,,,,,,"<a href=""http://digital.lib.uiowa.edu/cdm/ref/collection/duffy/id/45"" target=""_blank"">View this item in its source respository</a>",,,,,,,,,,,,,,,,,,,,,,,,,,,,,https://www.iowaheritage.org/files/original/b1bbe4a09f3168eeb5cb2cd2b3fb0da1.jpg,"Remote Item","Editorial Cartoons of Brian Duffy",1,0
64301,https://www.iowaheritage.org/items/show/64301,"They were cheaper than buying gas for the mower","Economic conditions|United States|Men|2000-2010|Economy|Recession|Oil -- Prices|Oil|Yards|Trees|Fences|Sheep|Houses",,"Duffy, Brian, 1955-",,"University of Iowa. Libraries. Special Collections Dept.",2008-06-18|2011-04,,"Educational use only, no other permissions given. Copyright to this digital object is owned by The Des Moines Register; it may not be downloaded, reproduced, or distributed without written permission. For more information, contact the Special Collections Department.","Editorial Cartoons of Brian Duffy; Des Moines Register Cartoonists|Papers of Brian Duffy|Des Moines Register",,English,"Still image|Editorial cartoons",MSC916|duffy-080618|http://digital.lib.uiowa.edu/cdm/ref/collection/duffy/id/139,,,,,,,,,,,,,,,,,,,,,,,,,,,,,,,,,,,,,,,,,,,,,,,,"<a href=""http://digital.lib.uiowa.edu/cdm/ref/collection/duffy/id/139"" target=""_blank"">View this item in its source respository</a>",,,,,,,,,,,,,,,,,,,,,,,,,,,,,https://www.iowaheritage.org/files/original/07e7b1f241865e2d3b5bb4f342a07452.jpg,"Remote Item","Editorial Cartoons of Brian Duffy",1,0
64506,https://www.iowaheritage.org/items/show/64506,"These Russian tractors certainly are different!","Farmers|United States|Farms|1980-1990|Farming|Farms|Cold War|Soviet Union -- Foreign relations|Foreign trade|Foreign relations|Imports|Farmland|Farmers|Tanks|Pigs|Barns|Smoke|Arrows","John Bear; SS-20 plow attachment","Duffy, Brian, 1955-",,"University of Iowa. Libraries. Special Collections Dept.",1984-08-02|2011-04,,"Educational use only, no other permissions given. Copyright to this digital object is owned by The Des Moines Register; it may not be downloaded, reproduced, or distributed without written permission. For more information, contact the Special Collections Department.","Editorial Cartoons of Brian Duffy; Des Moines Register Cartoonists|Papers of Brian Duffy|Des Moines Register",,English,"Still image|Editorial cartoons",MSC916|duffy-840802|http://digital.lib.uiowa.edu/cdm/ref/collection/duffy/id/344,,,,,,,,,,,,,,,,,,,,,,,,,,,,,,,,,,,,,,,,,,,,,,,,"<a href=""http://digital.lib.uiowa.edu/cdm/ref/collection/duffy/id/344"" target=""_blank"">View this item in its source respository</a>",,,,,,,,,,,,,,,,,,,,,,,,,,,,,https://www.iowaheritage.org/files/original/adfdca008eb2671543bb893e0f862d68.jpg,"Remote Item","Editorial Cartoons of Brian Duffy",1,0
64691,https://www.iowaheritage.org/items/show/64691,"There you go again ... scaring the elderly!","Politicians|Ganske, John Greg|Iowa|Halloween|1990-2000|Political platforms|Campaigning|Campaigns|Issues|Medicare|McBurney, Connie|Men|Women|Older people|Moon|Houses|Doors|Bags","Look who's talking, Dr. Medicare Slasher!; McBurney; Ganske","Duffy, Brian, 1955-",,"University of Iowa. Libraries. Special Collections Dept.",1996-10-20|2011-04,,"Educational use only, no other permissions given. Copyright to this digital object is owned by The Des Moines Register; it may not be downloaded, reproduced, or distributed without written permission. For more information, contact the Special Collections Department.","Editorial Cartoons of Brian Duffy; Des Moines Register Cartoonists|Papers of Brian Duffy|Des Moines Register",,English,"Still image|Editorial cartoons",MSC916|duffy-961020|http://digital.lib.uiowa.edu/cdm/ref/collection/duffy/id/529,,,,,,,,,,,,,,,,,,,,,,,,,,,,,,,,,,,,,,,,,,,,,,,,"<a href=""http://digital.lib.uiowa.edu/cdm/ref/collection/duffy/id/529"" target=""_blank"">View this item in its source respository</a>",,,,,,,,,,,,,,,,,,,,,,,,,,,,,https://www.iowaheritage.org/files/original/111b3db214ae1d5c6c4e47dacf9095bd.jpg,"Remote Item","Editorial Cartoons of Brian Duffy",1,0
64671,https://www.iowaheritage.org/items/show/64671,"The year of the woman","Equality|Iowa|Women|1990-2000|Women's rights|Women|Voters|Votes|Voting|Banners|Men|Trees|Streets|Parades|Leaves","ERA; Congress; Statehouse; NOT!; Iowa","Duffy, Brian, 1955-",,"University of Iowa. Libraries. Special Collections Dept.",1992-11-07|2011-04,,"Educational use only, no other permissions given. Copyright to this digital object is owned by The Des Moines Register; it may not be downloaded, reproduced, or distributed without written permission. For more information, contact the Special Collections Department.","Editorial Cartoons of Brian Duffy; Des Moines Register Cartoonists|Papers of Brian Duffy|Des Moines Register",,English,"Still image|Editorial cartoons",MSC916|duffy-921107|http://digital.lib.uiowa.edu/cdm/ref/collection/duffy/id/509,,,,,,,,,,,,,,,,,,,,,,,,,,,,,,,,,,,,,,,,,,,,,,,,"<a href=""http://digital.lib.uiowa.edu/cdm/ref/collection/duffy/id/509"" target=""_blank"">View this item in its source respository</a>",,,,,,,,,,,,,,,,,,,,,,,,,,,,,https://www.iowaheritage.org/files/original/a96948329c12c28bcf34b10bd993841e.jpg,"Remote Item","Editorial Cartoons of Brian Duffy",1,0
64236,https://www.iowaheritage.org/items/show/64236,"The Yanks are in the World Series","Baseball|United States|September 11 Terrorist Attacks, 2001|Men|2000-2010|Championships|Cities|Sports|New York (N.Y.)|Benches|Parks|Pigeons|Running|Newspapers|Buildings","Sports; Yankees American League champs; Well at least some things are right with the world","Duffy, Brian, 1955-",,"University of Iowa. Libraries. Special Collections Dept.",2001-10-24|2011-04,,"Educational use only, no other permissions given. Copyright to this digital object is owned by The Des Moines Register; it may not be downloaded, reproduced, or distributed without written permission. For more information, contact the Special Collections Department.","Editorial Cartoons of Brian Duffy; Des Moines Register Cartoonists|Papers of Brian Duffy|Des Moines Register",,English,"Still image|Editorial cartoons",MSC916|duffy-011024|http://digital.lib.uiowa.edu/cdm/ref/collection/duffy/id/74,,,,,,,,,,,,,,,,,,,,,,,,,,,,,,,,,,,,,,,,,,,,,,,,"<a href=""http://digital.lib.uiowa.edu/cdm/ref/collection/duffy/id/74"" target=""_blank"">View this item in its source respository</a>",,,,,,,,,,,,,,,,,,,,,,,,,,,,,https://www.iowaheritage.org/files/original/b1041f31c14e020f966ab32f297fa5ac.jpg,"Remote Item","Editorial Cartoons of Brian Duffy",1,0
64541,https://www.iowaheritage.org/items/show/64541,"The warm beer sisters are here to check the temperature of the Miller Lite","Legislation|Doderer, Minnette, 1923-2005|Iowa|Grocers|1980-1990|Legislature|Alcohol|Beer|Regulation|Regulations|Lloyd-Jones|Jean|Grocers|Grocery stores|Beer|Wine|Women|Men|Axes|Hatchets|Thermometers|Pencils|Aprons|Bonnets|Stores|Shelving","Food; Lloyd-Jones; Doderer; Al","Duffy, Brian, 1955-",,"University of Iowa. Libraries. Special Collections Dept.",1985-03-07|2011-04,,"Educational use only, no other permissions given. Copyright to this digital object is owned by The Des Moines Register; it may not be downloaded, reproduced, or distributed without written permission. For more information, contact the Special Collections Department.","Editorial Cartoons of Brian Duffy; Des Moines Register Cartoonists|Papers of Brian Duffy|Des Moines Register",,English,"Still image|Editorial cartoons",MSC916|duffy-850307|http://digital.lib.uiowa.edu/cdm/ref/collection/duffy/id/379,,,,,,,,,,,,,,,,,,,,,,,,,,,,,,,,,,,,,,,,,,,,,,,,"<a href=""http://digital.lib.uiowa.edu/cdm/ref/collection/duffy/id/379"" target=""_blank"">View this item in its source respository</a>",,,,,,,,,,,,,,,,,,,,,,,,,,,,,https://www.iowaheritage.org/files/original/0597c5086a78a897a083cb3400485575.jpg,"Remote Item","Editorial Cartoons of Brian Duffy",1,0
64342,https://www.iowaheritage.org/items/show/64342,"The U.S. made us do it!","Airplanes|Soviet Union|Korean Air Lines Incident, 1983|Caves|1980-1990|Terrorism|Violence|Aggression (International law)|Bears|Bears, Russian|Signs|Footprints|Smoke|Airplane crashes|Hammer & sickle|Rocks|Skulls|Bones","What plane; We didn't do it; We might have done it; We did it ... so what!","Duffy, Brian, 1955-",,"University of Iowa. Libraries. Special Collections Dept.",1983-09-12|2011-04,,"Educational use only, no other permissions given. Copyright to this digital object is owned by The Des Moines Register; it may not be downloaded, reproduced, or distributed without written permission. For more information, contact the Special Collections Department.","Editorial Cartoons of Brian Duffy; Des Moines Register Cartoonists|Papers of Brian Duffy|Des Moines Register",,English,"Still image|Editorial cartoons",MSC916|duffy-830912|http://digital.lib.uiowa.edu/cdm/ref/collection/duffy/id/180,,,,,,,,,,,,,,,,,,,,,,,,,,,,,,,,,,,,,,,,,,,,,,,,"<a href=""http://digital.lib.uiowa.edu/cdm/ref/collection/duffy/id/180"" target=""_blank"">View this item in its source respository</a>",,,,,,,,,,,,,,,,,,,,,,,,,,,,,https://www.iowaheritage.org/files/original/c6aecaffe3fd8f1893bcdf5aaaaa3395.jpg,"Remote Item","Editorial Cartoons of Brian Duffy",1,0
