 




﻿"Item Id","Item URI","Dublin Core:Title","Dublin Core:Subject","Dublin Core:Description","Dublin Core:Creator","Dublin Core:Source","Dublin Core:Publisher","Dublin Core:Date","Dublin Core:Contributor","Dublin Core:Rights","Dublin Core:Relation","Dublin Core:Format","Dublin Core:Language","Dublin Core:Type","Dublin Core:Identifier","Dublin Core:Coverage","Item Type Metadata:Text","Item Type Metadata:Interviewer","Item Type Metadata:Interviewee","Item Type Metadata:Location","Item Type Metadata:Transcription","Item Type Metadata:Local URL","Item Type Metadata:Original Format","Item Type Metadata:Physical Dimensions","Item Type Metadata:Duration","Item Type Metadata:Compression","Item Type Metadata:Producer","Item Type Metadata:Director","Item Type Metadata:Bit Rate/Frequency","Item Type Metadata:Time Summary","Item Type Metadata:Email Body","Item Type Metadata:Subject Line","Item Type Metadata:From","Item Type Metadata:To","Item Type Metadata:CC","Item Type Metadata:BCC","Item Type Metadata:Number of Attachments","Item Type Metadata:Standards","Item Type Metadata:Objectives","Item Type Metadata:Materials","Item Type Metadata:Lesson Plan Text","Item Type Metadata:URL","Item Type Metadata:Event Type","Item Type Metadata:Participants","Item Type Metadata:Birth Date","Item Type Metadata:Birthplace","Item Type Metadata:Death Date","Item Type Metadata:Occupation","Item Type Metadata:Biographical Text","Item Type Metadata:Bibliography","Item Type Metadata:Digital Reproduction Information","Item Type Metadata:Repository","Item Type Metadata:Repository Collection","Item Type Metadata:Contact information.","Item Type Metadata:File Name","Item Type Metadata:Notes","Item Type Metadata:Digital item created","Item Type Metadata:Digital item modified","Item Type Metadata:Executive Orders","Item Type Metadata:Record Created","Item Type Metadata:Record Modified","Item Type Metadata:Transcription2","Item Type Metadata:Source URL","Omeka Legacy File:Additional Creator","Omeka Legacy File:Transcriber","Omeka Legacy File:Producer","Omeka Legacy File:Render Device","Omeka Legacy File:Render Details","Omeka Legacy File:Capture Date","Omeka Legacy File:Capture Device","Omeka Legacy File:Capture Details","Omeka Legacy File:Change History","Omeka Legacy File:Watermark","Omeka Legacy File:Encryption","Omeka Legacy File:Compression","Omeka Legacy File:Post Processing","Omeka Image File:Width","Omeka Image File:Height","Omeka Image File:Bit Depth","Omeka Image File:Channels","Omeka Image File:Exif String","Omeka Image File:Exif Array","Omeka Image File:IPTC String","Omeka Image File:IPTC Array","Omeka Video File:Bitrate","Omeka Video File:Duration","Omeka Video File:Sample Rate","Omeka Video File:Codec","Omeka Video File:Width","Omeka Video File:Height",tags,file,itemType,collection,public,featured
5694,http://www.iowaheritage.org/items/show/5694,"An issue which was bound to come up sooner or later anyway.","Government|Coolidge, Calvin, 1872-1933|Airplanes|military|Army|Navy|Air Force|budgets|Wilbur, Curtis Dwight, 1867-1954|Weeks, John Wingate, 1860-1926||chickens|ducks|eagles.",,"Darling, Jay N. (Jay Norwood), 1876-1962","The Editorial cartoons of J.N. ""Ding"" Darling [electronic resource] : The Cowles Collection, Drake University, 1912-1962",,1925/02/21|1925,,"Copyright is owned by the ""Ding"" Darling Wildlife Society; it is administered on behalf of the Society by The University of Iowa. While use within the classroom is encouraged without specific authorization, publishing this cartoon in any format requires written permission. See policy and permissions procedure at: http://www.lib.uiowa.edu/spec-coll/services/dingdarling_fees.html","Cowles Library, Drake University, 2507 University Ave., Des Moines, IA 50311-4505.",,,,"250221.jpg|http://ddr.lib.drake.edu/u?/ddarling,2823",,,,,,,,,,,,,,,,,,,,,,,,,,,,,,,,,,,,,,,,,,,,,,,,"<a href=""http://ddr.lib.drake.edu/u?/ddarling,2823"" target=""_blank"">View this item in its source respository</a>",,,,,,,,,,,,,,,,,,,,,,,,,,,,,http://www.iowaheritage.org/files/original/7237ac295d04d51bb43050b4f14494bd.jpg,"Remote Item","Editorial Cartoons of J.N. ""Ding"" Darling, Drake University",1,0
5357,http://www.iowaheritage.org/items/show/5357,"Circumstances entirely beyond her control.","Government|Coolidge, Calvin, 1872-1933|United States|Ducks|politics|U.S. Senate|foreign policy|commerce|Europe|chickens|Uncle Sam.",,"Darling, Jay N. (Jay Norwood), 1876-1962","The Editorial cartoons of J.N. ""Ding"" Darling [electronic resource] : The Cowles Collection, Drake University, 1912-1962",,1923/12/14|1923,,"Copyright is owned by the ""Ding"" Darling Wildlife Society; it is administered on behalf of the Society by The University of Iowa. While use within the classroom is encouraged without specific authorization, publishing this cartoon in any format requires written permission. See policy and permissions procedure at: http://www.lib.uiowa.edu/spec-coll/services/dingdarling_fees.html","Cowles Library, Drake University, 2507 University Ave., Des Moines, IA 50311-4505.",,,,"231214.jpg|http://ddr.lib.drake.edu/u?/ddarling,2486",,,,,,,,,,,,,,,,,,,,,,,,,,,,,,,,,,,,,,,,,,,,,,,,"<a href=""http://ddr.lib.drake.edu/u?/ddarling,2486"" target=""_blank"">View this item in its source respository</a>",,,,,,,,,,,,,,,,,,,,,,,,,,,,,http://www.iowaheritage.org/files/original/1fdfe3555a9acb399c0b0cef4bea6e3f.jpg,"Remote Item","Editorial Cartoons of J.N. ""Ding"" Darling, Drake University",1,0
23423,http://www.iowaheritage.org/items/show/23423,"Crowd standing on the bank of a river while a duck swims past, The University of Iowa, 1911","Ducks|University of Iowa|United States -- Iowa -- Iowa City|1910-1920|Crowds|Rivers",,"Kent, Frederick W. (Frederick Wallace), 1894-1984",,"University of Iowa. Libraries. University Archives",1911,,"Educational use only, no other permissions given. U.S. and international copyright laws may protect this digital object. Commercial use or distribution of the object is not permitted without prior permission of the copyright holder.","Iowa City Town and Campus Scenes|Frederick W. Kent Collection of Photographs, 1866-2000|http://www.lib.uiowa.edu/collguides/?RG30.0001.01|Prints|Scanned with Ricoh Aficio 3228C @ 300 ppi, full color. Master images saved in tiff format.",11|13,,"Still image|Photographs|jpeg",RG30.0001.01|https://digital.lib.uiowa.edu/,,,,,,,,,,,,,,,,,,,,,,,,,,,,,,,,,,,,,,,,,,,,,,,,"<a href=""https://digital.lib.uiowa.edu/"" target=""_blank"">View this item in its source respository</a>",,,,,,,,,,,,,,,,,,,,,,,,,,,,,http://www.iowaheritage.org/files/original/6f3cff1433587510fd88042d45862fb7.jpg,"Remote Item","Iowa City Town and Campus Scenes",1,0
64483,http://www.iowaheritage.org/items/show/64483,"Drake relays","Sports|Des Moines (Iowa)|Ducks|1990-2000|Track athletics|Weather|Rain|Outdoors|Bulldogs|Rain|Track athletics|Tracks|Batons|Umbrellas|Running",,"Duffy, Brian, 1955-",,"University of Iowa. Libraries. Special Collections Dept.",1995-04-30|2011-04,,"Educational use only, no other permissions given. Copyright to this digital object is owned by The Des Moines Register; it may not be downloaded, reproduced, or distributed without written permission. For more information, contact the Special Collections Department.","Editorial Cartoons of Brian Duffy; Des Moines Register Cartoonists|Papers of Brian Duffy|Des Moines Register",,English,"Still image|Editorial cartoons",MSC916|duffy-950430|http://digital.lib.uiowa.edu/cdm/ref/collection/duffy/id/321,,,,,,,,,,,,,,,,,,,,,,,,,,,,,,,,,,,,,,,,,,,,,,,,"<a href=""http://digital.lib.uiowa.edu/cdm/ref/collection/duffy/id/321"" target=""_blank"">View this item in its source respository</a>",,,,,,,,,,,,,,,,,,,,,,,,,,,,,http://www.iowaheritage.org/files/original/c9e114d6d9be6d036ea4f69847cb668f.jpg,"Remote Item","Editorial Cartoons of Brian Duffy",1,0
12002,http://www.iowaheritage.org/items/show/12002,"Ducks swimming in floodwater, The University of Iowa, June 13, 2008","Floods|University of Iowa|United States -- Iowa -- Iowa City|2000-2010|Evacuations|Disaster relief|Ducks|","Ducks swim in floodwater on Friday, June 13, 2008.","Schoon, Tim",,"University of Iowa. University News Services",2008-06-13|2008-06-13,,"Educational use only, no other permissions given. U.S. and international copyright laws may protect this item. Commercial use or distribution of this digital object is not permitted without written permission of the copyright holder.","Iowa City Flood|Flood Images|Flood, June 13, 2008",jpeg,,"Still image|Photographs",https://digital.lib.uiowa.edu/,,,,,,,,,,,,,,,,,,,,,,,,,,,,,,,,,,,,,,,,,,,,,,,,"<a href=""https://digital.lib.uiowa.edu/"" target=""_blank"">View this item in its source respository</a>",,,,,,,,,,,,,,,,,,,,,,,,,,,,,http://www.iowaheritage.org/files/original/b015999aea10574a3c15651a0c6a388c.jpg,"Remote Item","Iowa City Flood",1,0
12062,http://www.iowaheritage.org/items/show/12062,"Family of ducks swimming in floodwater, The University of Iowa, June 14, 2008","Floods|University of Iowa|United States -- Iowa -- Iowa City|2000-2010|Evacuations|Disaster relief|Ducks|United States -- Iowa -- Iowa River","Photos taken the morning of June 14 before the Iowa River crested the following day at 31.51 feet.","Jorgensen, Tom",,"University of Iowa. University News Services",2008-06-14|2008-06-14,,"Educational use only, no other permissions given. U.S. and international copyright laws may protect this item. Commercial use or distribution of this digital object is not permitted without written permission of the copyright holder.","Iowa City Flood|Flood Images|Campus Flooding, June 14, 2008",jpeg,,"Still image|Photographs",https://digital.lib.uiowa.edu/,,,,,,,,,,,,,,,,,,,,,,,,,,,,,,,,,,,,,,,,,,,,,,,,"<a href=""https://digital.lib.uiowa.edu/"" target=""_blank"">View this item in its source respository</a>",,,,,,,,,,,,,,,,,,,,,,,,,,,,,http://www.iowaheritage.org/files/original/808041fb41ec76617d3ffe45e3aaa6fc.jpg,"Remote Item","Iowa City Flood",1,0
31085,http://www.iowaheritage.org/items/show/31085,"First-grade students feeding ducks, The University of Iowa, May 15, 1930","Universities & colleges|Elementary schools|University of Iowa|United States -- Iowa -- Iowa City|1930-1940|Schools|School children|Ducks|Animal feeding|Flowers|University of Iowa. College of Education","The University Elementary School,established in 1915, was a laboratory or experimental school directed through the College of Education for the training of principals, superintendents and teachers. Along with the University High School, it was closed in 1972 due to lack of funding.","Kent, Frederick W. (Frederick Wallace), 1894-1984",,"University of Iowa. Libraries. University Archives",1930-05-15|2010-09-12,,"Educational use only, no other permissions given. U.S. and international copyright laws may protect this digital object. Commercial use or distribution of the object is not permitted without prior permission of the copyright holder.","Iowa City Town and Campus Scenes|Frederick W. Kent Collection of Photographs, 1866-2000|http://www.lib.uiowa.edu/collguides/?RG30.0001.01|Prints|Organizations|University Elementary School|University Elementary School|Scanned with Ricoh Aficio 3228C @ 600 ppi. Master image saved in TIFF format",5|7,,"Still image|Photographs|jpeg",RG30.0001.01|index.cpd|https://digital.lib.uiowa.edu/,,,,,,,,,,,,,,,,,,,,,,,,,,,,,,,,,,,,,,,,,,,,,,,,"<a href=""https://digital.lib.uiowa.edu/"" target=""_blank"">View this item in its source respository</a>",,,,,,,,,,,,,,,,,,,,,,,,,,,,,http://www.iowaheritage.org/files/original/062419d3a4ce3da19b5b8d8f28a9fe58.jpg,"Remote Item","Iowa City Town and Campus Scenes",1,0
31086,http://www.iowaheritage.org/items/show/31086,"First-grade students feeding ducks, The University of Iowa, May 15, 1930","Universities & colleges|Elementary schools|University of Iowa|United States -- Iowa -- Iowa City|1930-1940|Schools|School children|Ducks|Animal feeding|Flowers|University of Iowa. College of Education","The University Elementary School,established in 1915, was a laboratory or experimental school directed through the College of Education for the training of principals, superintendents and teachers. Along with the University High School, it was closed in 1972 due to lack of funding.","Kent, Frederick W. (Frederick Wallace), 1894-1984",,"University of Iowa. Libraries. University Archives",1930-05-15|2010-09-12,,"Educational use only, no other permissions given. U.S. and international copyright laws may protect this digital object. Commercial use or distribution of the object is not permitted without prior permission of the copyright holder.","Iowa City Town and Campus Scenes|Frederick W. Kent Collection of Photographs, 1866-2000|http://www.lib.uiowa.edu/collguides/?RG30.0001.01|Prints|Organizations|University Elementary School|University Elementary School|Scanned with Ricoh Aficio 3228C @ 600 ppi. Master image saved in TIFF format",4|7,,"Still image|Photographs|jpeg",RG30.0001.01|index.cpd|https://digital.lib.uiowa.edu/,,,,,,,,,,,,,,,,,,,,,,,,,,,,,,,,,,,,,,,,,,,,,,,,"<a href=""https://digital.lib.uiowa.edu/"" target=""_blank"">View this item in its source respository</a>",,,,,,,,,,,,,,,,,,,,,,,,,,,,,http://www.iowaheritage.org/files/original/2687ef1a316b6d0d7570dc873e129bd9.jpg,"Remote Item","Iowa City Town and Campus Scenes",1,0
12145,http://www.iowaheritage.org/items/show/12145,"Flood aftermath, The University of Iowa, June 26, 2008","Floods|University of Iowa|United States -- Iowa -- Iowa City|2000-2010|Evacuations|Disaster relief|Rivers|Ducks|United States -- Iowa -- Iowa River","Assorted photos around Iowa River after flooding.","Schoon, Tim",,"University of Iowa. University News Services",2008-06-26|2008-06-26,,"Educational use only, no other permissions given. U.S. and international copyright laws may protect this item. Commercial use or distribution of this digital object is not permitted without written permission of the copyright holder.","Iowa City Flood|Flood Images|Flood cleanup, June 26, 2008",jpeg,,"Still image|Photographs",https://digital.lib.uiowa.edu/,,,,,,,,,,,,,,,,,,,,,,,,,,,,,,,,,,,,,,,,,,,,,,,,"<a href=""https://digital.lib.uiowa.edu/"" target=""_blank"">View this item in its source respository</a>",,,,,,,,,,,,,,,,,,,,,,,,,,,,,http://www.iowaheritage.org/files/original/3886d6cd4719e54772458b87effbf029.jpg,"Remote Item","Iowa City Flood",1,0
12147,http://www.iowaheritage.org/items/show/12147,"Flooding near Voxman Music Building, The University of Iowa, June 16, 2008","Floods|University of Iowa|United States -- Iowa -- Iowa City|2000-2010|Evacuations|Disaster relief|Ducks||Voxman Music Building (Iowa City, Iowa)","Images of flooding near the Voxman Music Building on Monday, June 16, 2008.","Schoon, Tim",,"University of Iowa. University News Services",2008-06-16|2008-06-16,,"Educational use only, no other permissions given. U.S. and international copyright laws may protect this item. Commercial use or distribution of this digital object is not permitted without written permission of the copyright holder.","Iowa City Flood|Flood Images|Flood, June 16, 2008",jpeg,,"Still image|Photographs",https://digital.lib.uiowa.edu/,,,,,,,,,,,,,,,,,,,,,,,,,,,,,,,,,,,,,,,,,,,,,,,,"<a href=""https://digital.lib.uiowa.edu/"" target=""_blank"">View this item in its source respository</a>",,,,,,,,,,,,,,,,,,,,,,,,,,,,,http://www.iowaheritage.org/files/original/77706f97fa2e359dd8bb8e5632e5c6ba.jpg,"Remote Item","Iowa City Flood",1,0
