 




﻿"Item Id","Item URI","Dublin Core:Title","Dublin Core:Subject","Dublin Core:Description","Dublin Core:Creator","Dublin Core:Source","Dublin Core:Publisher","Dublin Core:Date","Dublin Core:Contributor","Dublin Core:Rights","Dublin Core:Relation","Dublin Core:Format","Dublin Core:Language","Dublin Core:Type","Dublin Core:Identifier","Dublin Core:Coverage","Item Type Metadata:Text","Item Type Metadata:Interviewer","Item Type Metadata:Interviewee","Item Type Metadata:Location","Item Type Metadata:Transcription","Item Type Metadata:Local URL","Item Type Metadata:Original Format","Item Type Metadata:Physical Dimensions","Item Type Metadata:Duration","Item Type Metadata:Compression","Item Type Metadata:Producer","Item Type Metadata:Director","Item Type Metadata:Bit Rate/Frequency","Item Type Metadata:Time Summary","Item Type Metadata:Email Body","Item Type Metadata:Subject Line","Item Type Metadata:From","Item Type Metadata:To","Item Type Metadata:CC","Item Type Metadata:BCC","Item Type Metadata:Number of Attachments","Item Type Metadata:Standards","Item Type Metadata:Objectives","Item Type Metadata:Materials","Item Type Metadata:Lesson Plan Text","Item Type Metadata:URL","Item Type Metadata:Event Type","Item Type Metadata:Participants","Item Type Metadata:Birth Date","Item Type Metadata:Birthplace","Item Type Metadata:Death Date","Item Type Metadata:Occupation","Item Type Metadata:Biographical Text","Item Type Metadata:Bibliography","Item Type Metadata:Digital Reproduction Information","Item Type Metadata:Repository","Item Type Metadata:Repository Collection","Item Type Metadata:Contact information.","Item Type Metadata:File Name","Item Type Metadata:Notes","Item Type Metadata:Digital item created","Item Type Metadata:Digital item modified","Item Type Metadata:Executive Orders","Item Type Metadata:Record Created","Item Type Metadata:Record Modified","Item Type Metadata:Transcription2","Item Type Metadata:Source URL","Omeka Legacy File:Additional Creator","Omeka Legacy File:Transcriber","Omeka Legacy File:Producer","Omeka Legacy File:Render Device","Omeka Legacy File:Render Details","Omeka Legacy File:Capture Date","Omeka Legacy File:Capture Device","Omeka Legacy File:Capture Details","Omeka Legacy File:Change History","Omeka Legacy File:Watermark","Omeka Legacy File:Encryption","Omeka Legacy File:Compression","Omeka Legacy File:Post Processing","Omeka Image File:Width","Omeka Image File:Height","Omeka Image File:Bit Depth","Omeka Image File:Channels","Omeka Image File:Exif String","Omeka Image File:Exif Array","Omeka Image File:IPTC String","Omeka Image File:IPTC Array","Omeka Video File:Bitrate","Omeka Video File:Duration","Omeka Video File:Sample Rate","Omeka Video File:Codec","Omeka Video File:Width","Omeka Video File:Height",tags,file,itemType,collection,public,featured
10431,http://www.iowaheritage.org/items/show/10431,"Chicago, Milwaukee and St. Paul Railroad cut, Manning, Iowa, June 10, 1915","Geology|Chicago, Milwaukee, and St. Paul Railway Company|United States -- Iowa -- Carroll County -- Manning|1910-1920|Cenozoic -- Pleistocene|Railroad cuts","Located 3.5 miles East of Manning, Warren Twp., section 13, N.W. 1/4.",unknown,"Photographs scanned using Epson Expression 1680 scanner at 300 ppi, 8-bit greyscale.","University of Iowa. Dept. of Geoscience. Paleontology Repository|Contact Tiffany Adrain (tiffany-adrain@uiowa.edu) at The University of Iowa Paleontology Repository http://www.uiowa.edu/~geology/paleo",1915-06-10|2006-03-23,,"This digital image may be used for educational purposes, as long as it is not altered in any way. No commercial reproduction or distribution of this file is permitted without permission.","Calvin Geological Photographs|This digital collection contains the geology-related images originally digitized for the Dept. of Geosciences' Calvin web exhibit: http://www.uiowa.edu/~calvin/calvin.htm . Calvin's images of Iowa City can be viewed in the Iowa City Town and Campus Scenes Digital Collection: http://digital.lib.uiowa.edu/ictcs",jpeg|5|7,,"Still image|Photographs; Dry collodion negatives",4494|5046|173611416|https://digital.lib.uiowa.edu/,,,,,,,,,,,,,,,,,,,,,,,,,,,,,,,,,,,,,,,,,,,,,,,,"<a href=""https://digital.lib.uiowa.edu/"" target=""_blank"">View this item in its source respository</a>",,,,,,,,,,,,,,,,,,,,,,,,,,,,,http://www.iowaheritage.org/files/original/37e647a91e9a3b5b618b1ffac27081ca.jpg,"Remote Item","African American Women in Iowa Collection",1,0
10782,http://www.iowaheritage.org/items/show/10782,"Chicago, Milwaukee and St. Paul Railroad cut, Manning, Iowa, June 8, 1915","Geology|Chicago, Milwaukee, and St. Paul Railway Company|United States -- Iowa -- Carroll County -- Manning|1910-1920|Cenozoic -- Pleistocene|Railroad cuts","Located 1.5 miles West of Manning, North side, Warren Twp., section 18, N.W. quarter.",unknown,"Photographs scanned using Epson Expression 1680 scanner at 300 ppi, 8-bit greyscale.","University of Iowa. Dept. of Geoscience. Paleontology Repository|Contact Tiffany Adrain (tiffany-adrain@uiowa.edu) at The University of Iowa Paleontology Repository http://www.uiowa.edu/~geology/paleo",1915-06-08|2006-03-23,,"This digital image may be used for educational purposes, as long as it is not altered in any way. No commercial reproduction or distribution of this file is permitted without permission.","Calvin Geological Photographs|This digital collection contains the geology-related images originally digitized for the Dept. of Geosciences' Calvin web exhibit: http://www.uiowa.edu/~calvin/calvin.htm . Calvin's images of Iowa City can be viewed in the Iowa City Town and Campus Scenes Digital Collection: http://digital.lib.uiowa.edu/ictcs",jpeg|5|7,,"Still image|Photographs; Dry collodion negatives",4489|5041|173611416|https://digital.lib.uiowa.edu/,,,,,,,,,,,,,,,,,,,,,,,,,,,,,,,,,,,,,,,,,,,,,,,,"<a href=""https://digital.lib.uiowa.edu/"" target=""_blank"">View this item in its source respository</a>",,,,,,,,,,,,,,,,,,,,,,,,,,,,,http://www.iowaheritage.org/files/original/cb8fbbb248835976cb38862c8e6cf0e7.jpg,"Remote Item","African American Women in Iowa Collection",1,0
10783,http://www.iowaheritage.org/items/show/10783,"Chicago, Milwaukee and St. Paul Railroad cut, Manning, Iowa, June 10, 1915","Geology|Chicago, Milwaukee, and St. Paul Railway Company|United States -- Iowa -- Carroll County -- Manning|1910-1920|Cenozoic -- Pleistocene|Railroad cuts","Located 1.5 miles East of Manning, Warren Twp., section 15, West 1/2.",unknown,"Photographs scanned using Epson Expression 1680 scanner at 300 ppi, 8-bit greyscale.","University of Iowa. Dept. of Geoscience. Paleontology Repository|Contact Tiffany Adrain (tiffany-adrain@uiowa.edu) at The University of Iowa Paleontology Repository http://www.uiowa.edu/~geology/paleo",1915-06-10|2006-03-23,,"This digital image may be used for educational purposes, as long as it is not altered in any way. No commercial reproduction or distribution of this file is permitted without permission.","Calvin Geological Photographs|This digital collection contains the geology-related images originally digitized for the Dept. of Geosciences' Calvin web exhibit: http://www.uiowa.edu/~calvin/calvin.htm . Calvin's images of Iowa City can be viewed in the Iowa City Town and Campus Scenes Digital Collection: http://digital.lib.uiowa.edu/ictcs",jpeg|5|7,,"Still image|Photographs; Dry collodion negatives",4490|5042|173611416|https://digital.lib.uiowa.edu/,,,,,,,,,,,,,,,,,,,,,,,,,,,,,,,,,,,,,,,,,,,,,,,,"<a href=""https://digital.lib.uiowa.edu/"" target=""_blank"">View this item in its source respository</a>",,,,,,,,,,,,,,,,,,,,,,,,,,,,,http://www.iowaheritage.org/files/original/b2b44af5dd8d90a14f293c55e10fb5fd.jpg,"Remote Item","African American Women in Iowa Collection",1,0
12701,http://www.iowaheritage.org/items/show/12701,"Manning, Iowa. MILW","Railroad stations|Chicago, Rock Island & Pacific Rail Road Co.|United States -- Iowa -- Carroll County -- Manning|1970-1980","Sign for Manning on two poles.  Buildings visible in background.",unknown,,"University of Iowa. Libraries. Special Collections Dept.",1978-04-14|2005-09-16,,"Educational use only, no other permissions given. U.S. and international copyright laws may protect this digital image. Commercial use or distribution of the image is not permitted without prior permission of the copyright holder. For information see:  http://www.lib.uiowa.edu/spec-coll/help/copyright.html","John P. Vander Maas Railroadiana|John P. Vander Maas Railroadiana Collection|MSC0468|http://lib.uiowa.edu/collguides/?MSC0468|Vol. 41, Depots by county",11|13,,"Still image|Photographs|jpeg",41manning01.jpg|169946290|https://digital.lib.uiowa.edu/,,,,,,,,,,,,,,,,,,,,,,,,,,,,,,,,,,,,,,,,,,,,,,,,"<a href=""https://digital.lib.uiowa.edu/"" target=""_blank"">View this item in its source respository</a>",,,,,,,,,,,,,,,,,,,,,,,,,,,,,http://www.iowaheritage.org/files/original/9fda8a7c211ac85d27fc63ee29b0dd43.jpg,"Remote Item","John P. Vander Maas Railroadiana",1,0
12707,http://www.iowaheritage.org/items/show/12707,"Manning, Iowa. CGW","Railroad stations|Chicago Great Western Railroad Company|United States -- Iowa -- Carroll County -- Manning|1960-1970|Buildings|Railroad signals","Single story wooden depot with two brick chimneys. Small shed behind depot.  Signal on tall pole and utility pole next to depot. ""James L. Rueber, 2509 South Shore Drive, Clear Lake, Iowa 50428""--Photograph verso.","Rueber, James L.",,"University of Iowa. Libraries. Special Collections Dept.",1967-07-21|2005-09-16,,"Educational use only, no other permissions given. U.S. and international copyright laws may protect this digital image. Commercial use or distribution of the image is not permitted without prior permission of the copyright holder. For information see:  http://www.lib.uiowa.edu/spec-coll/help/copyright.html","John P. Vander Maas Railroadiana|John P. Vander Maas Railroadiana Collection|MSC0468|http://lib.uiowa.edu/collguides/?MSC0468|Vol. 41, Depots by county",13|18,,"Still image|Photographs|jpeg",41manning02.jpg|169946290|https://digital.lib.uiowa.edu/,,,,,,,,,,,,,,,,,,,,,,,,,,,,,,,,,,,,,,,,,,,,,,,,"<a href=""https://digital.lib.uiowa.edu/"" target=""_blank"">View this item in its source respository</a>",,,,,,,,,,,,,,,,,,,,,,,,,,,,,http://www.iowaheritage.org/files/original/f263bc80235a8226f59a7ae7edef1606.jpg,"Remote Item","John P. Vander Maas Railroadiana",1,0
12714,http://www.iowaheritage.org/items/show/12714,"Manning, IA. CNW (CGW)","Railroad stations|Chicago and North Western Railway Company|United States -- Iowa -- Carroll County -- Manning|1980-1990|Grain elevators|Railroad signals|Railroad cars|Chicago Great Western Railroad Company","Grain elevators to left of tracks.  Signal next to tracks.  Railroad car on tracks.",unknown,,"University of Iowa. Libraries. Special Collections Dept.",1982-10-11|2005-09-16,,"Educational use only, no other permissions given. U.S. and international copyright laws may protect this digital image. Commercial use or distribution of the image is not permitted without prior permission of the copyright holder. For information see:  http://www.lib.uiowa.edu/spec-coll/help/copyright.html","John P. Vander Maas Railroadiana|John P. Vander Maas Railroadiana Collection|MSC0468|http://lib.uiowa.edu/collguides/?MSC0468|Vol. 41, Depots by county",8|12,,"Still image|Photographs|jpeg",41manning05.jpg|169946290|https://digital.lib.uiowa.edu/,,,,,,,,,,,,,,,,,,,,,,,,,,,,,,,,,,,,,,,,,,,,,,,,"<a href=""https://digital.lib.uiowa.edu/"" target=""_blank"">View this item in its source respository</a>",,,,,,,,,,,,,,,,,,,,,,,,,,,,,http://www.iowaheritage.org/files/original/2c0a37ebd64d5193c0c24a2106040e9c.jpg,"Remote Item","John P. Vander Maas Railroadiana",1,0
12715,http://www.iowaheritage.org/items/show/12715,"Manning, Iowa. MILW","Railroad stations|Chicago, Rock Island & Pacific Rail Road Co.|United States -- Iowa -- Carroll County -- Manning|1980-1990|Barns","Overgrown tracks with barns and other outbuildings on the left side.",unknown,,"University of Iowa. Libraries. Special Collections Dept.",1982-10-11|2005-09-16,,"Educational use only, no other permissions given. U.S. and international copyright laws may protect this digital image. Commercial use or distribution of the image is not permitted without prior permission of the copyright holder. For information see:  http://www.lib.uiowa.edu/spec-coll/help/copyright.html","John P. Vander Maas Railroadiana|John P. Vander Maas Railroadiana Collection|MSC0468|http://lib.uiowa.edu/collguides/?MSC0468|Vol. 41, Depots by county",8|12,,"Still image|Photographs|jpeg",41manning04.jpg|169946290|https://digital.lib.uiowa.edu/,,,,,,,,,,,,,,,,,,,,,,,,,,,,,,,,,,,,,,,,,,,,,,,,"<a href=""https://digital.lib.uiowa.edu/"" target=""_blank"">View this item in its source respository</a>",,,,,,,,,,,,,,,,,,,,,,,,,,,,,http://www.iowaheritage.org/files/original/cc9aadb42e15de3ada429d1034eaf4fb.jpg,"Remote Item","John P. Vander Maas Railroadiana",1,0
12720,http://www.iowaheritage.org/items/show/12720,"Manning, Iowa. MILW","Railroad stations|Chicago, Rock Island & Pacific Rail Road Co.|United States -- Iowa -- Carroll County -- Manning|1960-1970|Buildings","Single story depot with cart in front and buildings behind. ""MILW Depot, Manning, Iowa 1962""--Caption on postcard.",unknown,,"University of Iowa. Libraries. Special Collections Dept.",1962|2005-09-16,,"Educational use only, no other permissions given. U.S. and international copyright laws may protect this digital image. Commercial use or distribution of the image is not permitted without prior permission of the copyright holder. For information see:  http://www.lib.uiowa.edu/spec-coll/help/copyright.html","John P. Vander Maas Railroadiana|John P. Vander Maas Railroadiana Collection|MSC0468|http://lib.uiowa.edu/collguides/?MSC0468|Vol. 41, Depots by county",9|14,,"Still image|Postcards|jpeg",41manning03.jpg|169946290|https://digital.lib.uiowa.edu/,,,,,,,,,,,,,,,,,,,,,,,,,,,,,,,,,,,,,,,,,,,,,,,,"<a href=""https://digital.lib.uiowa.edu/"" target=""_blank"">View this item in its source respository</a>",,,,,,,,,,,,,,,,,,,,,,,,,,,,,http://www.iowaheritage.org/files/original/da78beb169abd6902ab642acc4853e91.jpg,"Remote Item","John P. Vander Maas Railroadiana",1,0
15456,http://www.iowaheritage.org/items/show/15456,"Chicago, Milwaukee and St. Paul Railroad cut, Manning, Iowa, June 10, 1915","Geology|Chicago, Milwaukee, and St. Paul Railway Company|United States -- Iowa -- Carroll County -- Manning|1910-1920|Cenozoic -- Pleistocene|Railroad cuts","Located 3.5 miles East of Manning, Warren Twp., section 13, N.W. 1/4.",unknown,"Photographs scanned using Epson Expression 1680 scanner at 300 ppi, 8-bit greyscale.","University of Iowa. Dept. of Geoscience. Paleontology Repository|Contact Tiffany Adrain (tiffany-adrain@uiowa.edu) at The University of Iowa Paleontology Repository http://www.uiowa.edu/~geology/paleo",1915-06-10|2006-03-23,,"This digital image may be used for educational purposes, as long as it is not altered in any way. No commercial reproduction or distribution of this file is permitted without permission.","Calvin Geological Photographs|This digital collection contains the geology-related images originally digitized for the Dept. of Geosciences' Calvin web exhibit: http://www.uiowa.edu/~calvin/calvin.htm . Calvin's images of Iowa City can be viewed in the Iowa City Town and Campus Scenes Digital Collection: http://digital.lib.uiowa.edu/ictcs",jpeg|5|7,,"Still image|Photographs; Dry collodion negatives",4494|5046|173611416|https://digital.lib.uiowa.edu/,,,,,,,,,,,,,,,,,,,,,,,,,,,,,,,,,,,,,,,,,,,,,,,,"<a href=""https://digital.lib.uiowa.edu/"" target=""_blank"">View this item in its source respository</a>",,,,,,,,,,,,,,,,,,,,,,,,,,,,,http://www.iowaheritage.org/files/original/15a8d2372afd0041c1d197fd1e006a21.jpg,"Remote Item","Calvin Geological Photographs",1,0
16123,http://www.iowaheritage.org/items/show/16123,"Chicago, Milwaukee and St. Paul Railroad cut, Manning, Iowa, June 8, 1915","Geology|Chicago, Milwaukee, and St. Paul Railway Company|United States -- Iowa -- Carroll County -- Manning|1910-1920|Cenozoic -- Pleistocene|Railroad cuts","Located 1.5 miles West of Manning, North side, Warren Twp., section 18, N.W. quarter.",unknown,"Photographs scanned using Epson Expression 1680 scanner at 300 ppi, 8-bit greyscale.","University of Iowa. Dept. of Geoscience. Paleontology Repository|Contact Tiffany Adrain (tiffany-adrain@uiowa.edu) at The University of Iowa Paleontology Repository http://www.uiowa.edu/~geology/paleo",1915-06-08|2006-03-23,,"This digital image may be used for educational purposes, as long as it is not altered in any way. No commercial reproduction or distribution of this file is permitted without permission.","Calvin Geological Photographs|This digital collection contains the geology-related images originally digitized for the Dept. of Geosciences' Calvin web exhibit: http://www.uiowa.edu/~calvin/calvin.htm . Calvin's images of Iowa City can be viewed in the Iowa City Town and Campus Scenes Digital Collection: http://digital.lib.uiowa.edu/ictcs",jpeg|5|7,,"Still image|Photographs; Dry collodion negatives",4489|5041|173611416|https://digital.lib.uiowa.edu/,,,,,,,,,,,,,,,,,,,,,,,,,,,,,,,,,,,,,,,,,,,,,,,,"<a href=""https://digital.lib.uiowa.edu/"" target=""_blank"">View this item in its source respository</a>",,,,,,,,,,,,,,,,,,,,,,,,,,,,,http://www.iowaheritage.org/files/original/c63ab2c0618c0d113c563cafe6bf04ea.jpg,"Remote Item","Calvin Geological Photographs",1,0
