 




﻿"Item Id","Item URI","Dublin Core:Title","Dublin Core:Subject","Dublin Core:Description","Dublin Core:Creator","Dublin Core:Source","Dublin Core:Publisher","Dublin Core:Date","Dublin Core:Contributor","Dublin Core:Rights","Dublin Core:Relation","Dublin Core:Format","Dublin Core:Language","Dublin Core:Type","Dublin Core:Identifier","Dublin Core:Coverage","Item Type Metadata:Text","Item Type Metadata:Interviewer","Item Type Metadata:Interviewee","Item Type Metadata:Location","Item Type Metadata:Transcription","Item Type Metadata:Local URL","Item Type Metadata:Original Format","Item Type Metadata:Physical Dimensions","Item Type Metadata:Duration","Item Type Metadata:Compression","Item Type Metadata:Producer","Item Type Metadata:Director","Item Type Metadata:Bit Rate/Frequency","Item Type Metadata:Time Summary","Item Type Metadata:Email Body","Item Type Metadata:Subject Line","Item Type Metadata:From","Item Type Metadata:To","Item Type Metadata:CC","Item Type Metadata:BCC","Item Type Metadata:Number of Attachments","Item Type Metadata:Standards","Item Type Metadata:Objectives","Item Type Metadata:Materials","Item Type Metadata:Lesson Plan Text","Item Type Metadata:URL","Item Type Metadata:Event Type","Item Type Metadata:Participants","Item Type Metadata:Birth Date","Item Type Metadata:Birthplace","Item Type Metadata:Death Date","Item Type Metadata:Occupation","Item Type Metadata:Biographical Text","Item Type Metadata:Bibliography","Item Type Metadata:Digital Reproduction Information","Item Type Metadata:Repository","Item Type Metadata:Repository Collection","Item Type Metadata:Contact information.","Item Type Metadata:File Name","Item Type Metadata:Notes","Item Type Metadata:Digital item created","Item Type Metadata:Digital item modified","Item Type Metadata:Executive Orders","Item Type Metadata:Record Created","Item Type Metadata:Record Modified","Item Type Metadata:Transcription2","Item Type Metadata:Source URL","Omeka Legacy File:Additional Creator","Omeka Legacy File:Transcriber","Omeka Legacy File:Producer","Omeka Legacy File:Render Device","Omeka Legacy File:Render Details","Omeka Legacy File:Capture Date","Omeka Legacy File:Capture Device","Omeka Legacy File:Capture Details","Omeka Legacy File:Change History","Omeka Legacy File:Watermark","Omeka Legacy File:Encryption","Omeka Legacy File:Compression","Omeka Legacy File:Post Processing","Omeka Image File:Width","Omeka Image File:Height","Omeka Image File:Bit Depth","Omeka Image File:Channels","Omeka Image File:Exif String","Omeka Image File:Exif Array","Omeka Image File:IPTC String","Omeka Image File:IPTC Array","Omeka Video File:Bitrate","Omeka Video File:Duration","Omeka Video File:Sample Rate","Omeka Video File:Codec","Omeka Video File:Width","Omeka Video File:Height",tags,file,itemType,collection,public,featured
19192,http://www.iowaheritage.org/items/show/19192,"Images from University of Iowa student Master's thesis on television production, 1941","Actors|Television producers and directors|W9XUI-TV (Television station: Iowa City, Iowa)|United States -- Iowa -- Iowa City|1940-1950|Actresses|Television broadcasting|Television production & direction|Theatrical producers & directors|Students|Television -- Equipment and supplies|University of Iowa","In 1941 Raymond H. Abel, a UI graduate student in speech and theatre arts, wrote his master's thesis, A Project and Preliminary Investigation of Problems Involved in Producing a Play for Television. The thesis recounted his experience directing a UI student drama production of A Cup of Coffee, based on the short story Coffee Cup Hero by Walter Hogan. According to Abel, the production was ""the first television dramatization ever presented in any educational institution."" The play was aired on station W9XUI, successor to W9XK, on May 15, 1941.","Abel, Raymond Harry",,"University of Iowa. University Archives",1941|2008-05-15,,"Educational use only, no other permissions given. U.S. and international copyright laws may protect this digital object. Commercial use or distribution of the object is not permitted without prior permission of the copyright holder.","Abel, Raymond Harry. A project and preliminary investigation of problems involved in producing a play for television. (University of Iowa, 1941)|W9XK Experimental Television at Iowa|http://www.lib.uiowa.edu/spec-coll/archives/guides",jpeg,,"Still image|Photographs; Plans (Orthographic projections); Scenography",https://digital.lib.uiowa.edu/,,,,,,,,,,,,,,,,,,,,,,,,,,,,,,,,,,,,,,,,,,,,,,,,"<a href=""https://digital.lib.uiowa.edu/"" target=""_blank"">View this item in its source respository</a>",,,,,,,,,,,,,,,,,,,,,,,,,,,,,http://www.iowaheritage.org/files/original/1ecf9c5ec627000ca9730eed240758d1.jpg,"Remote Item","W9XK Experimental Television at Iowa",1,0
19172,http://www.iowaheritage.org/items/show/19172,"E.B. Kurtz adjusting telecasting equipment, The University of Iowa, 1930s","Television broadcasting|Television -- Equipment and supplies|Kurtz, Edwin Bernard, 1894-|W9XK-TV (Television station: Iowa City, Iowa)|United States -- Iowa -- Iowa City|1930-1940|Motion picture devices|Television -- Repairing|University of Iowa","An over-all view of W9XK's telecasting equipment, showing scanning unit (at left) and amplifier-monitor panel. Handles on scanner are used to direct scanning beam on object in studio on other side of the wall. Prof. E.B. Kurtz, head of the Electrical Engineering Department, is shown adjusting the quality of the outgoing signal. At far left, in the studio, is the call-letters sign identifying W9XK which was used at the beginning and end of each broadcast.",,,"University of Iowa. University Archives",1930/1939|2008-05-15,,"Educational use only, no other permissions given. U.S. and international copyright laws may protect this digital object. Commercial use or distribution of the object is not permitted without prior permission of the copyright holder.","W9XK Experimental Television at Iowa|F.W. Kent Photographs: Colleges and Departments|http://www.lib.uiowa.edu/spec-coll/archives/guides|Engineering, miscellaneous view sub-folder",jpeg,,"Still image|Photographs",w9xk035_1932.jpg|https://digital.lib.uiowa.edu/,,,,,,,,,,,,,,,,,,,,,,,,,,,,,,,,,,,,,,,,,,,,,,,,"<a href=""https://digital.lib.uiowa.edu/"" target=""_blank"">View this item in its source respository</a>",,,,,,,,,,,,,,,,,,,,,,,,,,,,,http://www.iowaheritage.org/files/original/175dce811bd8603ec73d9094490a5edc.jpg,"Remote Item","W9XK Experimental Television at Iowa",1,0
19169,http://www.iowaheritage.org/items/show/19169,"Art instructor Aden Arnold of the Plastic and Graphics Arts Department sketches a portrait during the course of his lecture on W9XK television, The University of Iowa, 1933","Television programs|Television -- Equipment and supplies|Arnold, A. F. (Aden F.), 1901-|W9XK-TV (Television station: Iowa City, Iowa)|United States -- Iowa -- Iowa City|1930-1940|Teachers|Art education|University of Iowa","There is a sound microphone in the right corner and photoelectric cells behind him.",,,"University of Iowa. University Archives",2008-05-15,,"Educational use only, no other permissions given. U.S. and international copyright laws may protect this digital object. Commercial use or distribution of the object is not permitted without prior permission of the copyright holder.","W9XK Experimental Television at Iowa|http://www.lib.uiowa.edu/spec-coll/archives/guides|Engineering, miscellaneous view sub-folder",jpeg,,"Still image|Photographs",w9xk034_1933.jpg|https://digital.lib.uiowa.edu/,,,,,,,,,,,,,,,,,,,,,,,,,,,,,,,,,,,,,,,,,,,,,,,,"<a href=""https://digital.lib.uiowa.edu/"" target=""_blank"">View this item in its source respository</a>",,,,,,,,,,,,,,,,,,,,,,,,,,,,,http://www.iowaheritage.org/files/original/d7056c108fc95363d89547e3c0f86fd3.jpg,"Remote Item","W9XK Experimental Television at Iowa",1,0
19166,http://www.iowaheritage.org/items/show/19166,"Ray C. Kent standing behind camera, The University of Iowa, 1941","Television broadcasting|Television -- Equipment and supplies|Kent, Raymond Carroll, 1914-|W9XUI-TV (Television station: Iowa City, Iowa)|United States -- Iowa -- Iowa City|1940-1950|Motion picture cameras|Teachers|University of Iowa","Television camera employing Iconoscope. Electrical engineering instructor Ray C. Kent is focusing W9XUI camera by adjusting large portrait lens, 1941.",,,"University of Iowa. University Archives",1941|2008-05-15,,"Educational use only, no other permissions given. U.S. and international copyright laws may protect this digital object. Commercial use or distribution of the object is not permitted without prior permission of the copyright holder.","W9XK Experimental Television at Iowa|F.W. Kent Photographs: Colleges and Departments|http://www.lib.uiowa.edu/spec-coll/archives/guides|Engineering, miscellaneous view sub-folder",jpeg,,"Still image|Photographs",w9xk033_1941.jpg|https://digital.lib.uiowa.edu/,,,,,,,,,,,,,,,,,,,,,,,,,,,,,,,,,,,,,,,,,,,,,,,,"<a href=""https://digital.lib.uiowa.edu/"" target=""_blank"">View this item in its source respository</a>",,,,,,,,,,,,,,,,,,,,,,,,,,,,,http://www.iowaheritage.org/files/original/8ba397c07d007f4814e39d90228a2557.jpg,"Remote Item","W9XK Experimental Television at Iowa",1,0
19157,http://www.iowaheritage.org/items/show/19157,"Television equipment: bank of photoelectric cells, The University of Iowa, 1933","Television broadcasting|Television -- Equipment and supplies|Kurtz, Edwin Bernard, 1894-|W9XK-TV (Television station: Iowa City, Iowa)|United States -- Iowa -- Iowa City|1930-1940|Lighting|University of Iowa","Prof. E.B. Kurtz, head of the Dept. of Electrical engineering, looking through a bank of ten photoelectric cells mounted in frame for use at W9XK studio, 1933.",,,"Iowa Transit (Iowa City, Iowa)|University of Iowa. University Archives",1933|2008-05-15,,"Educational use only, no other permissions given. U.S. and international copyright laws may protect this digital object. Commercial use or distribution of the object is not permitted without prior permission of the copyright holder.","W9XK Experimental Television at Iowa|F.W. Kent Photographs: Colleges and Departments|http://www.lib.uiowa.edu/spec-coll/archives/guides|Engineering",jpeg,,"Still image|Photographs",w9xk030_1930.jpg|https://digital.lib.uiowa.edu/,,,,,,,,,,,,,,,,,,,,,,,,,,,,,,,,,,,,,,,,,,,,,,,,"<a href=""https://digital.lib.uiowa.edu/"" target=""_blank"">View this item in its source respository</a>",,,,,,,,,,,,,,,,,,,,,,,,,,,,,http://www.iowaheritage.org/files/original/7087d0256f3213a60bc91f30a4bfe09d.jpg,"Remote Item","W9XK Experimental Television at Iowa",1,0
19154,http://www.iowaheritage.org/items/show/19154,"E.B. Kurtz tuning a television receiving set at W9XK television station, The University of Iowa, ca. 1933","Television broadcasting|Television -- Equipment and supplies|Kurtz, Edwin Bernard, 1894-|W9XK-TV (Television station: Iowa City, Iowa)|United States -- Iowa -- Iowa City|1930-1940|University of Iowa|Echophone Company","Prof. E.B. Kurtz, head of the Dept. of Electrical Engineering, adjusting a television receiving set manufactured by Echophone Company.  Echophone manufactured sets that were capable of receiving the W9XK signal.",,,"University of Iowa. University Archives",1933|2008-05-15,,"Educational use only, no other permissions given. U.S. and international copyright laws may protect this digital object. Commercial use or distribution of the object is not permitted without prior permission of the copyright holder.","W9XK Experimental Television at Iowa|F.W. Kent Photographs: Colleges and Departments|http://www.lib.uiowa.edu/spec-coll/archives/guides|Engineering",jpeg,,"Still image|Photographs",w9xk029_1930.jpg|https://digital.lib.uiowa.edu/,,,,,,,,,,,,,,,,,,,,,,,,,,,,,,,,,,,,,,,,,,,,,,,,"<a href=""https://digital.lib.uiowa.edu/"" target=""_blank"">View this item in its source respository</a>",,,,,,,,,,,,,,,,,,,,,,,,,,,,,http://www.iowaheritage.org/files/original/e9641cc48cbe97843a574e0b29b349de.jpg,"Remote Item","W9XK Experimental Television at Iowa",1,0
19145,http://www.iowaheritage.org/items/show/19145,"""SUI to broadcast more detailed pictures,"" July 25, 1940","Television broadcasting|Television stations--Licenses|Kurtz, Edwin Bernard, 1894-|W9XUI-TV (Television station: Iowa City, Iowa)|United States -- Iowa -- Iowa City|1940-1950|Students|Television frequency allocation|Television -- Equipment and supplies|Hyde, C. W.|Braun, O. R.|University of Iowa","Report on newly-licensed W9XUI, broadcasting on VHF television band.",,,"Daily Iowan (Iowa City, Iowa)|University of Iowa. University Archives",1940-07-25|2008-05-15,,"Educational use only, no other permissions given. U.S. and international copyright laws may protect this digital object. Commercial use or distribution of the object is not permitted without prior permission of the copyright holder.","W9XK Experimental Television at Iowa|Subject Vertical Files: Television|http://www.lib.uiowa.edu/spec-coll/archives/guides|1930s and 1940s, folder 2",jpeg,,"Text; Still image|Clippings; Photographs",RG01.15.05|w9xk026.jpg|https://digital.lib.uiowa.edu/,,,,,,,,,,,,,,,,,,,,,,,,,,,,,,,,,,,,,,,,,,,,,,,,"<a href=""https://digital.lib.uiowa.edu/"" target=""_blank"">View this item in its source respository</a>",,,,,,,,,,,,,,,,,,,,,,,,,,,,,http://www.iowaheritage.org/files/original/8d5baf4d80f02d49728c0779ac08651d.jpg,"Remote Item","W9XK Experimental Television at Iowa",1,0
19125,http://www.iowaheritage.org/items/show/19125,"Correspondence between University of Iowa Electrical Engineering Prof. James T. Rood and WSUI radio station manager Carl Menzer, June 7, 1929","Television broadcasting|Television stations--Licenses|Rood, James T.|W9XK-TV (Television station: Iowa City, Iowa)|United States -- Iowa -- Iowa City|1920-1930|Television -- Equipment and supplies|Menzer, Carl|University of Iowa|WSUI (Radio station : Iowa City, Iowa)","Rood, a professor of engineering, expressed skepticism of plans for an experimental television station at the University of Iowa, in this letter addressed to Carl Menzer, manager of radio station WSUI.","Rood, James T.",,"University of Iowa. University Archives",1929-06-07|2008-05-15,,"Educational use only, no other permissions given. U.S. and international copyright laws may protect this digital object. Commercial use or distribution of the object is not permitted without prior permission of the copyright holder.","W9XK Experimental Television at Iowa|Subject Vertical Files: Television|http://www.lib.uiowa.edu/spec-coll/archives/guides|1930s and 1940s, folder 1",jpeg,,Text|Correspondence,RG01.15.05|w9xk013_1929-06-07.jpg|https://digital.lib.uiowa.edu/,,,,,,,,,,,,,,,,,,,,,,,,,,,,,,,,,,,,,,,,,,,,,,,,"<a href=""https://digital.lib.uiowa.edu/"" target=""_blank"">View this item in its source respository</a>",,,,,,,,,,,,,,,,,,,,,,,,,,,,,http://www.iowaheritage.org/files/original/091dad9a0379a7f7b6a2323da87a77ed.jpg,"Remote Item","W9XK Experimental Television at Iowa",1,0
19122,http://www.iowaheritage.org/items/show/19122,"Correspondence between University of Iowa Dean of College of Engineering Prof. F.M. Dawson and university president W.A. Jessup, January 13, 1932","Television broadcasting|Television -- Equipment and supplies|Dawson, Francis Murray, 1889-|W9XK-TV (Television station: Iowa City, Iowa)|United States -- Iowa -- Iowa City|1930-1940|Television studios|Jessup, Walter Albert, 1877-1944|Kurtz, Edwin Bernard, 1894-|Menzer, Carl|University of Iowa|Western Television Corporation|United States -- Illinois -- Chicago","Requesting permission for Prof. E.B. Kurtz, College of Engineering, to meet with Chicago engineers concerning television broadcasting equipment needs.","Dawson, Francis Murray, 1889-",,"University of Iowa. University Archives",1932-01-13|2008-05-15,,"Educational use only, no other permissions given. U.S. and international copyright laws may protect this digital object. Commercial use or distribution of the object is not permitted without prior permission of the copyright holder.","W9XK Experimental Television at Iowa|Subject Vertical Files: Television|http://www.lib.uiowa.edu/spec-coll/archives/guides|1930s and 1940s, folder 1",jpeg,,Text|Correspondence,RG01.15.05|w9xk011_1932-01-13.jpg|https://digital.lib.uiowa.edu/,,,,,,,,,,,,,,,,,,,,,,,,,,,,,,,,,,,,,,,,,,,,,,,,"<a href=""https://digital.lib.uiowa.edu/"" target=""_blank"">View this item in its source respository</a>",,,,,,,,,,,,,,,,,,,,,,,,,,,,,http://www.iowaheritage.org/files/original/3c4e6ec6ce97f862e8415876f4bc3947.jpg,"Remote Item","W9XK Experimental Television at Iowa",1,0
19116,http://www.iowaheritage.org/items/show/19116,"Correspondence between University of Iowa Dean of College of Engineering Prof. F.M. Dawson and university president W.A. Jessup, July 27, 1931","Television broadcasting|Television -- Equipment and supplies|Jessup, Walter Albert, 1877-1944|W9XK-TV (Television station: Iowa City, Iowa)|United States -- Iowa -- Iowa City|1930-1940|Dawson, Francis Murray, 1889-|Menzer, Carl|University of Iowa|Western Television Corporation|United States -- Illinois -- Chicago","Seeking permission to travel to Chicago to meet with Western Television Corporation officials about project.","Dawson, Francis Murray, 1889-",,"University of Iowa. University Archives",1931-07-27|2008-05-15,,"Educational use only, no other permissions given. U.S. and international copyright laws may protect this digital object. Commercial use or distribution of the object is not permitted without prior permission of the copyright holder.","W9XK Experimental Television at Iowa|Subject Vertical Files: Television|http://www.lib.uiowa.edu/spec-coll/archives/guides/RG01.15.05.htm#Televisionhhttp://www.lib.uiowa.edu/spec-coll/archives/guides|1930s and 1940s, folder 1",jpeg,,Text|Correspondence,RG01.15.05|w9xk009_1931-07-27.jpg|https://digital.lib.uiowa.edu/,,,,,,,,,,,,,,,,,,,,,,,,,,,,,,,,,,,,,,,,,,,,,,,,"<a href=""https://digital.lib.uiowa.edu/"" target=""_blank"">View this item in its source respository</a>",,,,,,,,,,,,,,,,,,,,,,,,,,,,,http://www.iowaheritage.org/files/original/28fd69405df0e60c255087341d89b4cd.jpg,"Remote Item","W9XK Experimental Television at Iowa",1,0
