 




﻿"Item Id","Item URI","Dublin Core:Title","Dublin Core:Subject","Dublin Core:Description","Dublin Core:Creator","Dublin Core:Source","Dublin Core:Publisher","Dublin Core:Date","Dublin Core:Contributor","Dublin Core:Rights","Dublin Core:Relation","Dublin Core:Format","Dublin Core:Language","Dublin Core:Type","Dublin Core:Identifier","Dublin Core:Coverage","Item Type Metadata:Text","Item Type Metadata:Interviewer","Item Type Metadata:Interviewee","Item Type Metadata:Location","Item Type Metadata:Transcription","Item Type Metadata:Local URL","Item Type Metadata:Original Format","Item Type Metadata:Physical Dimensions","Item Type Metadata:Duration","Item Type Metadata:Compression","Item Type Metadata:Producer","Item Type Metadata:Director","Item Type Metadata:Bit Rate/Frequency","Item Type Metadata:Time Summary","Item Type Metadata:Email Body","Item Type Metadata:Subject Line","Item Type Metadata:From","Item Type Metadata:To","Item Type Metadata:CC","Item Type Metadata:BCC","Item Type Metadata:Number of Attachments","Item Type Metadata:Standards","Item Type Metadata:Objectives","Item Type Metadata:Materials","Item Type Metadata:Lesson Plan Text","Item Type Metadata:URL","Item Type Metadata:Event Type","Item Type Metadata:Participants","Item Type Metadata:Birth Date","Item Type Metadata:Birthplace","Item Type Metadata:Death Date","Item Type Metadata:Occupation","Item Type Metadata:Biographical Text","Item Type Metadata:Bibliography","Item Type Metadata:Digital Reproduction Information","Item Type Metadata:Repository","Item Type Metadata:Repository Collection","Item Type Metadata:Contact information.","Item Type Metadata:File Name","Item Type Metadata:Notes","Item Type Metadata:Digital item created","Item Type Metadata:Digital item modified","Item Type Metadata:Executive Orders","Item Type Metadata:Record Created","Item Type Metadata:Record Modified","Item Type Metadata:Transcription2","Item Type Metadata:Source URL","Omeka Legacy File:Additional Creator","Omeka Legacy File:Transcriber","Omeka Legacy File:Producer","Omeka Legacy File:Render Device","Omeka Legacy File:Render Details","Omeka Legacy File:Capture Date","Omeka Legacy File:Capture Device","Omeka Legacy File:Capture Details","Omeka Legacy File:Change History","Omeka Legacy File:Watermark","Omeka Legacy File:Encryption","Omeka Legacy File:Compression","Omeka Legacy File:Post Processing","Omeka Image File:Width","Omeka Image File:Height","Omeka Image File:Bit Depth","Omeka Image File:Channels","Omeka Image File:Exif String","Omeka Image File:Exif Array","Omeka Image File:IPTC String","Omeka Image File:IPTC Array","Omeka Video File:Bitrate","Omeka Video File:Duration","Omeka Video File:Sample Rate","Omeka Video File:Codec","Omeka Video File:Width","Omeka Video File:Height",tags,file,itemType,collection,public,featured
29359,http://www.iowaheritage.org/items/show/29359,"???|Morning Register (Des Moines, Iowa)|Women's military activity","Women|World War, 1939-1945|United States. Naval Reserve. Women's Reserve|United States -- Iowa -- Polk County -- Des Moines|1940-1950|World War II|Soldiers|World War, 1939-1945 -- Participation, Female|Women soldiers -- Iowa",,,,"State Historical Society of Iowa, Iowa City",1945-07-08|2009-07-13,,"This digital image may be used for educational purposes, as long as it is not altered in any way.  No commercial reproduction or distribution of this file is permitted without written permission of the State Historical Society of Iowa",,"Jpeg|image/jpeg|1 clipping : b&w ; 3 x 10 cm",eng,"Clippings; Text|Text|Clippings (Information Artifacts)",1945-07-08-02.jpg|https://digital.lib.uiowa.edu/,,,,,,,,,,,,,,,,,,,,,,,,,,,,,,,,,,,,,,,,,,,,,,,,"<a href=""https://digital.lib.uiowa.edu/"" target=""_blank"">View this item in its source respository</a>",,,,,,,,,,,,,,,,,,,,,,,,,,,,,http://www.iowaheritage.org/files/original/c26cc6ed868989bc4afc2abd01e4738b.jpg,"Remote Item","World War II Iowa Press Clippings",1,0
29388,http://www.iowaheritage.org/items/show/29388,"???|Morning Register (Des Moines, Iowa)|Women's military activity","Women|World War, 1939-1945|United States. Army. Women's Army Corps|United States. Naval Reserve. Women's Reserve|United States -- Iowa -- Polk County -- Des Moines|1940-1950|World War II|Soldiers|World War, 1939-1945 -- Particpation, Female|Women soldiers -- Iowa -- Fort Des Moines",,,,"State Historical Society of Iowa, Iowa City",2009-08-24,,"The digital image may be used for educational purposes, as long as it is not altered in any way.  No commercial reproduction or distribution of this file is permitted without written permission of the State Historical Society of Iowa.",,"jpeg|image/jpeg|1 clipping : b&w ; 3 x 10 cm|1 clipping : b&w ; 3 x 10 cm",eng,"Text; Clippings|Text|Clippings (Information artifacts)",https://digital.lib.uiowa.edu/,,,,,,,,,,,,,,,,,,,,,,,,,,,,,,,,,,,,,,,,,,,,,,,,"<a href=""https://digital.lib.uiowa.edu/"" target=""_blank"">View this item in its source respository</a>",,,,,,,,,,,,,,,,,,,,,,,,,,,,,http://www.iowaheritage.org/files/original/0c770d539b3e8640629a69ab89cb8996.jpg,"Remote Item","World War II Iowa Press Clippings",1,0
29425,http://www.iowaheritage.org/items/show/29425,"'Share service' week proclaimed|Evening Tribune (Des Moines, Iowa)|Women's military activity","Women|United States. Army. Women's Army Corps|United States -- Iowa|World War II|Soldiers|World War, 1939-1945 -- Particpation, Female|Women soldiers|United States. Naval Reserve. Women's Reserve|World War, 1939-1945 -- Participation, Female|Women soldiers",,,,"State Historical Society of Iowa, Iowa City",1951-11-09|2009-09-08,,"The digital image may be used for educational purposes, as long as it is not altered in any way.  No commercial reproduction or distribution of this file is permitted without written permission of the State Historical Society of Iowa.","World War II Iowa press clippings;","jpeg|image/jpeg|1 clipping : b&w ; 9 x 5 cm|1 clipping : b&w ; 9 x 5 cm",eng,"Text; Clippings|Text|Clippings (Information artifacts)",https://digital.lib.uiowa.edu/,,,,,,,,,,,,,,,,,,,,,,,,,,,,,,,,,,,,,,,,,,,,,,,,"<a href=""https://digital.lib.uiowa.edu/"" target=""_blank"">View this item in its source respository</a>",,,,,,,,,,,,,,,,,,,,,,,,,,,,,http://www.iowaheritage.org/files/original/2cf6c07772c544983c90867c40be7b23.jpg,"Remote Item","World War II Iowa Press Clippings",1,0
3705,http://www.iowaheritage.org/items/show/3705,"(Top):  We nominate for peace commissioners as follows--                                     (Middle):  For the commission to arrange details of evacuation.                              (Bottom):  And for the commission to settle practical details of Wilson's peace demands.","War|Wilhelm II, German Emperor, 1859-1941|World War, 1914-1918|Germany|Soldiers|peace|defeat|negotiations|Wilson, Woodrow, 1856-1924|Belgium|Serbia|France|Italy|Montenegro.|conference.",,"Darling, Jay N. (Jay Norwood), 1876-1962","The Editorial cartoons of J.N. ""Ding"" Darling [electronic resource] : The Cowles Collection, Drake University, 1912-1962",,1918/10/13|1918,,"Copyright is owned by the ""Ding"" Darling Wildlife Society; it is administered on behalf of the Society by The University of Iowa. While use within the classroom is encouraged without specific authorization, publishing this cartoon in any format requires written permission. See policy and permissions procedure at: http://www.lib.uiowa.edu/spec-coll/services/dingdarling_fees.html","Cowles Library, Drake University, 2507 University Ave., Des Moines, IA 50311-4505.",,,,"181013b.jpg|http://ddr.lib.drake.edu/u?/ddarling,834",,,,,,,,,,,,,,,,,,,,,,,,,,,,,,,,,,,,,,,,,,,,,,,,"<a href=""http://ddr.lib.drake.edu/u?/ddarling,834"" target=""_blank"">View this item in its source respository</a>",,,,,,,,,,,,,,,,,,,,,,,,,,,,,http://www.iowaheritage.org/files/original/61ffdacad8d73b1d81934918b5b1bd9b.jpg,"Remote Item","Editorial Cartoons of J.N. ""Ding"" Darling, Drake University",1,0
21579,http://www.iowaheritage.org/items/show/21579,"$255 clothes each WAAC|Tribune (Des Moines, Iowa)|Women's military activity","Women|World War, 1939-1945|United States. Army. Women's Army Auxiliary Corps|United States. Army. Women's Army Auxiliary Corps|United States -- Iowa -- Polk County -- Fort Des Moines|1940-1950|World War II|Soldiers|World War, 1939-1945 -- Participation, Female|Women soldiers -- Iowa -- Fort Des Moines|Fort Des Moines (Iowa)",,,,"State Historical Society of Iowa (Iowa City)","1942-07-01|1941;  1942;  1943;  1944;  1945;  1946;  1947;  1948;  1949;  1950|2006-04-04",,"This digital image may be used for educational purposes, as long as it is not altered in any way. No commercial reproduction or distribution of this file is permitted without written permission of the State Historical Society of Iowa.","World War II Iowa Press Clippings","jpeg|image/jpeg; Display image: 294,080 bytes|27|11",English,"Text; Clippings|Text|Clippings (Information artifacts)",1942-07-01-01.jpg|173848404|https://digital.lib.uiowa.edu/,,,,,,,,,,,,,,,,,,,,,,,,,,,,,,,,,,,,,,,,,,,,,,,,"<a href=""https://digital.lib.uiowa.edu/"" target=""_blank"">View this item in its source respository</a>",,,,,,,,,,,,,,,,,,,,,,,,,,,,,http://www.iowaheritage.org/files/original/377512561814844a39279930b30c360c.jpg,"Remote Item","World War II Iowa Press Clippings",1,0
22143,http://www.iowaheritage.org/items/show/22143,"1,000 -- and WAACs too -- hear band|Tranquil concert scene in wartime - 11 from corps play own parts|Register (Des Moines, Iowa)|Women's military activity","Women|World War, 1939-1945|United States. Army. Women's Army Auxiliary Corps|United States. Army. Women's Army Auxiliary Corps|United States -- Iowa -- Polk County -- Fort Des Moines|1940-1950|World War II|Soldiers|World War, 1939-1945 -- Participation, Female|Women soldiers -- Iowa -- Fort Des Moines|Fort Des Moines (Iowa)","Image of children sitting on the steps of a bandstand accompanies article.",,,"State Historical Society of Iowa (Iowa City)","1942-08-24|1941;  1942;  1943;  1944;  1945;  1946;  1947;  1948;  1949;  1950|2006-05-11",,"This digital image may be used for educational purposes, as long as it is not altered in any way. No commercial reproduction or distribution of this file is permitted without written permission of the State Historical Society of Iowa.","World War II Iowa Press Clippings",jpeg|image/jpeg|16|16,English,"Still image; Text; Clippings|Text; Still image|Clippings (Information artifacts)",1942-08-24-03.jpg|173848404|https://digital.lib.uiowa.edu/,,,,,,,,,,,,,,,,,,,,,,,,,,,,,,,,,,,,,,,,,,,,,,,,"<a href=""https://digital.lib.uiowa.edu/"" target=""_blank"">View this item in its source respository</a>",,,,,,,,,,,,,,,,,,,,,,,,,,,,,http://www.iowaheritage.org/files/original/4e4f2bedd4178a141919090aa9bce36d.jpg,"Remote Item","World War II Iowa Press Clippings",1,0
22531,http://www.iowaheritage.org/items/show/22531,"1,000 WAVES to reside in Bartlett dormitory|Record (Cedar Falls, Iowa)|Women's military activity","Women|World War, 1939-1945|United States. Naval Reserve. Women's Reserve|United States. Naval Reserve. Women's Reserve|United States -- Iowa -- Black Hawk County -- Cedar Falls|1940-1950|World War II|Soldiers|World War, 1939-1945 -- Participation, Female|Women soldiers -- Iowa -- Cedar Falls",,,,"State Historical Society of Iowa (Iowa City)","1942-10-08|1941;  1942;  1943;  1944;  1945;  1946;  1947;  1948;  1949;  1950|2006-07-10",,"This digital image may be used for educational purposes, as long as it is not altered in any way. No commercial reproduction or distribution of this file is permitted without written permission of the State Historical Society of Iowa.","World War II Iowa Press Clippings",jpeg|image/jpeg|24|11,English,"Text; Clippings|Text|Clippings (Information artifacts)",1942-10-08-09.jpg|173848404|https://digital.lib.uiowa.edu/,,,,,,,,,,,,,,,,,,,,,,,,,,,,,,,,,,,,,,,,,,,,,,,,"<a href=""https://digital.lib.uiowa.edu/"" target=""_blank"">View this item in its source respository</a>",,,,,,,,,,,,,,,,,,,,,,,,,,,,,http://www.iowaheritage.org/files/original/7aafe8b900876de6c61581d0f01486df.jpg,"Remote Item","World War II Iowa Press Clippings",1,0
22167,http://www.iowaheritage.org/items/show/22167,"1,000 women to open first class December 15|Register (Des Moines, Iowa)|Women's military activity","Women|World War, 1939-1945|United States. Naval Reserve. Women's Reserve|United States. Naval Reserve. Women's Reserve|United States -- Iowa -- Black Hawk County -- Cedar Falls|1940-1950|World War II|Soldiers|World War, 1939-1945 -- Participation, Female|Women soldiers -- Iowa -- Cedar Falls",,,,"State Historical Society of Iowa (Iowa City)","1942-09-30|1941;  1942;  1943;  1944;  1945;  1946;  1947;  1948;  1949;  1950|2006-05-11",,"This digital image may be used for educational purposes, as long as it is not altered in any way. No commercial reproduction or distribution of this file is permitted without written permission of the State Historical Society of Iowa.","World War II Iowa Press Clippings",jpeg|image/jpeg|22|5,English,"Text; Clippings|Text|Clippings (Information artifacts)",1942-09-30-01.jpg|173848404|https://digital.lib.uiowa.edu/,,,,,,,,,,,,,,,,,,,,,,,,,,,,,,,,,,,,,,,,,,,,,,,,"<a href=""https://digital.lib.uiowa.edu/"" target=""_blank"">View this item in its source respository</a>",,,,,,,,,,,,,,,,,,,,,,,,,,,,,http://www.iowaheritage.org/files/original/3a325f09046c7a1f53cff1dc1237cc3a.jpg,"Remote Item","World War II Iowa Press Clippings",1,0
23573,http://www.iowaheritage.org/items/show/23573,"1,040 WAVES graduated from campus|Record (Cedar Falls, Iowa)|Women's military activity","Women|World War, 1939-1945|United States. Naval Reserve. Women's Reserve|United States. Naval Reserve. Women's Reserve|United States -- Iowa -- Black Hawk County -- Cedar Falls|1940-1950|World War II|Soldiers|World War, 1939-1945 -- Participation, Female|Women soldiers -- Iowa -- Cedar Falls",,,,"State Historical Society of Iowa (Iowa City)","1943-01-16|1941;  1942;  1943;  1944;  1945;  1946;  1947;  1948;  1949;  1950|2006-09-15",,"This digital image may be used for educational purposes, as long as it is not altered in any way. No commercial reproduction or distribution of this file is permitted without written permission of the State Historical Society of Iowa.","World War II Iowa Press Clippings",jpeg|image/jpeg|17|10,English,"Text; Clippings|Text|Clippings (Information artifacts)",1943-01-16-02.jpg|173848404|https://digital.lib.uiowa.edu/,,,,,,,,,,,,,,,,,,,,,,,,,,,,,,,,,,,,,,,,,,,,,,,,"<a href=""https://digital.lib.uiowa.edu/"" target=""_blank"">View this item in its source respository</a>",,,,,,,,,,,,,,,,,,,,,,,,,,,,,http://www.iowaheritage.org/files/original/6b47e9b529833998236a2e90fda64e55.jpg,"Remote Item","World War II Iowa Press Clippings",1,0
23030,http://www.iowaheritage.org/items/show/23030,"1,050 trainees will arrive next Tuesday|College Eye (Cedar Fallls, Iowa)|Women's military activity","Women|World War, 1939-1945|United States. Naval Reserve. Women's Reserve|United States. Naval Reserve. Women's Reserve|United States -- Iowa -- Black Hawk County -- Cedar Falls|1940-1950|World War II|Soldiers|World War, 1939-1945 -- Participation, Female|Women soldiers -- Iowa -- Cedar Falls",,,,"State Historical Society of Iowa (Iowa City)","1942-12-11|1941;  1942;  1943;  1944;  1945;  1946;  1947;  1948;  1949;  1950|2006-07-10",,"This digital image may be used for educational purposes, as long as it is not altered in any way. No commercial reproduction or distribution of this file is permitted without written permission of the State Historical Society of Iowa.","World War II Iowa Press Clippings",jpeg|image/jpeg|24|6,English,"Text; Clippings|Text|Clippings (Information artifacts)",1942-12-11-01.jpg|173848404|https://digital.lib.uiowa.edu/,,,,,,,,,,,,,,,,,,,,,,,,,,,,,,,,,,,,,,,,,,,,,,,,"<a href=""https://digital.lib.uiowa.edu/"" target=""_blank"">View this item in its source respository</a>",,,,,,,,,,,,,,,,,,,,,,,,,,,,,http://www.iowaheritage.org/files/original/27783e6b1af0a57bfefb5dd0892b657d.jpg,"Remote Item","World War II Iowa Press Clippings",1,0
