 




﻿"Item Id","Item URI","Dublin Core:Title","Dublin Core:Subject","Dublin Core:Description","Dublin Core:Creator","Dublin Core:Source","Dublin Core:Publisher","Dublin Core:Date","Dublin Core:Contributor","Dublin Core:Rights","Dublin Core:Relation","Dublin Core:Format","Dublin Core:Language","Dublin Core:Type","Dublin Core:Identifier","Dublin Core:Coverage","Item Type Metadata:Text","Item Type Metadata:Interviewer","Item Type Metadata:Interviewee","Item Type Metadata:Location","Item Type Metadata:Transcription","Item Type Metadata:Local URL","Item Type Metadata:Original Format","Item Type Metadata:Physical Dimensions","Item Type Metadata:Duration","Item Type Metadata:Compression","Item Type Metadata:Producer","Item Type Metadata:Director","Item Type Metadata:Bit Rate/Frequency","Item Type Metadata:Time Summary","Item Type Metadata:Email Body","Item Type Metadata:Subject Line","Item Type Metadata:From","Item Type Metadata:To","Item Type Metadata:CC","Item Type Metadata:BCC","Item Type Metadata:Number of Attachments","Item Type Metadata:Standards","Item Type Metadata:Objectives","Item Type Metadata:Materials","Item Type Metadata:Lesson Plan Text","Item Type Metadata:URL","Item Type Metadata:Event Type","Item Type Metadata:Participants","Item Type Metadata:Birth Date","Item Type Metadata:Birthplace","Item Type Metadata:Death Date","Item Type Metadata:Occupation","Item Type Metadata:Biographical Text","Item Type Metadata:Bibliography","Item Type Metadata:Digital Reproduction Information","Item Type Metadata:Repository","Item Type Metadata:Repository Collection","Item Type Metadata:Contact information.","Item Type Metadata:File Name","Item Type Metadata:Notes","Item Type Metadata:Digital item created","Item Type Metadata:Digital item modified","Item Type Metadata:Executive Orders","Item Type Metadata:Record Created","Item Type Metadata:Record Modified","Item Type Metadata:Transcription2","Item Type Metadata:Source URL","Omeka Legacy File:Additional Creator","Omeka Legacy File:Transcriber","Omeka Legacy File:Producer","Omeka Legacy File:Render Device","Omeka Legacy File:Render Details","Omeka Legacy File:Capture Date","Omeka Legacy File:Capture Device","Omeka Legacy File:Capture Details","Omeka Legacy File:Change History","Omeka Legacy File:Watermark","Omeka Legacy File:Encryption","Omeka Legacy File:Compression","Omeka Legacy File:Post Processing","Omeka Image File:Width","Omeka Image File:Height","Omeka Image File:Bit Depth","Omeka Image File:Channels","Omeka Image File:Exif String","Omeka Image File:Exif Array","Omeka Image File:IPTC String","Omeka Image File:IPTC Array","Omeka Video File:Bitrate","Omeka Video File:Duration","Omeka Video File:Sample Rate","Omeka Video File:Codec","Omeka Video File:Width","Omeka Video File:Height",tags,file,itemType,collection,public,featured
64175,http://www.iowaheritage.org/items/show/64175,"Would you like the name of a good undertaker?","Governors|Vilsack, Thomas J.|Iowa|Men|2000-2010|Republicans|Legislature|Budgets|Politicians|Politics|Political parties|Governors|Elephants|Desks|Books|Stamps","Vilsack budget; DOA; Legislature","Duffy, Brian, 1955-",,"University of Iowa. Libraries. Special Collections Dept.",2000-01-16|2011-04,,"Educational use only, no other permissions given. Copyright to this digital object is owned by The Des Moines Register; it may not be downloaded, reproduced, or distributed without written permission. For more information, contact the Special Collections Department.","Editorial Cartoons of Brian Duffy; Des Moines Register Cartoonists|Papers of Brian Duffy|Des Moines Register",,English,"Still image|Editorial cartoons",MSC916|duffy-000116|http://digital.lib.uiowa.edu/cdm/ref/collection/duffy/id/13,,,,,,,,,,,,,,,,,,,,,,,,,,,,,,,,,,,,,,,,,,,,,,,,"<a href=""http://digital.lib.uiowa.edu/cdm/ref/collection/duffy/id/13"" target=""_blank"">View this item in its source respository</a>",,,,,,,,,,,,,,,,,,,,,,,,,,,,,http://www.iowaheritage.org/files/original/14fb3386ff2c5afca506736d6ee0f78a.jpg,"Remote Item","Editorial Cartoons of Brian Duffy",1,0
64184,http://www.iowaheritage.org/items/show/64184,"I'm sorry, Governor, did you say something?","Governors|Vilsack, Thomas J.|Iowa|Men|2000-2010|Elections|Politics|Political parties|Political violence|Politicians|Republicans|Democrats|Elephants|Stars|Hands|Clubs","Legislature; The election is over, let's let bygones be bygones ... what do you say?","Duffy, Brian, 1955-",,"University of Iowa. Libraries. Special Collections Dept.",2000-11-15|2011-04,,"Educational use only, no other permissions given. Copyright to this digital object is owned by The Des Moines Register; it may not be downloaded, reproduced, or distributed without written permission. For more information, contact the Special Collections Department.","Editorial Cartoons of Brian Duffy; Des Moines Register Cartoonists|Papers of Brian Duffy|Des Moines Register",,English,"Still image|Editorial cartoons",MSC916|duffy-001115|http://digital.lib.uiowa.edu/cdm/ref/collection/duffy/id/22,,,,,,,,,,,,,,,,,,,,,,,,,,,,,,,,,,,,,,,,,,,,,,,,"<a href=""http://digital.lib.uiowa.edu/cdm/ref/collection/duffy/id/22"" target=""_blank"">View this item in its source respository</a>",,,,,,,,,,,,,,,,,,,,,,,,,,,,,http://www.iowaheritage.org/files/original/a3ff3b227f0ace1110c05a047a6d710f.jpg,"Remote Item","Editorial Cartoons of Brian Duffy",1,0
64284,http://www.iowaheritage.org/items/show/64284,"Checks and balances","Elections|United States|Elephants|2000-2010|Politics|Political parties|Politicians|Congress|Republicans|Power|Scales","Election; Bang","Duffy, Brian, 1955-",,"University of Iowa. Libraries. Special Collections Dept.",2004-11-04|2011-04,,"Educational use only, no other permissions given. Copyright to this digital object is owned by The Des Moines Register; it may not be downloaded, reproduced, or distributed without written permission. For more information, contact the Special Collections Department.","Editorial Cartoons of Brian Duffy; Des Moines Register Cartoonists|Papers of Brian Duffy|Des Moines Register",,English,"Still image|Editorial cartoons",MSC916|duffy-041104|http://digital.lib.uiowa.edu/cdm/ref/collection/duffy/id/122,,,,,,,,,,,,,,,,,,,,,,,,,,,,,,,,,,,,,,,,,,,,,,,,"<a href=""http://digital.lib.uiowa.edu/cdm/ref/collection/duffy/id/122"" target=""_blank"">View this item in its source respository</a>",,,,,,,,,,,,,,,,,,,,,,,,,,,,,http://www.iowaheritage.org/files/original/ccf2010efaef34183f915281510a386e.jpg,"Remote Item","Editorial Cartoons of Brian Duffy",1,0
64286,http://www.iowaheritage.org/items/show/64286,"Looks like the two of you are going to have to cooperate","Elections|United States|Women|2000-2010|Politics|Political parties|Politicians|Congress|Democrats|Republicans|Donkeys|Elephants",,"Duffy, Brian, 1955-",,"University of Iowa. Libraries. Special Collections Dept.",2004-11-07|2011-04,,"Educational use only, no other permissions given. Copyright to this digital object is owned by The Des Moines Register; it may not be downloaded, reproduced, or distributed without written permission. For more information, contact the Special Collections Department.","Editorial Cartoons of Brian Duffy; Des Moines Register Cartoonists|Papers of Brian Duffy|Des Moines Register",,English,"Still image|Editorial cartoons",MSC916|duffy-041107|http://digital.lib.uiowa.edu/cdm/ref/collection/duffy/id/124,,,,,,,,,,,,,,,,,,,,,,,,,,,,,,,,,,,,,,,,,,,,,,,,"<a href=""http://digital.lib.uiowa.edu/cdm/ref/collection/duffy/id/124"" target=""_blank"">View this item in its source respository</a>",,,,,,,,,,,,,,,,,,,,,,,,,,,,,http://www.iowaheritage.org/files/original/0191d425b02da650f39cd8a394045004.jpg,"Remote Item","Editorial Cartoons of Brian Duffy",1,0
64296,http://www.iowaheritage.org/items/show/64296,"The clock's about to run out","Presidents|Bush, George W. (George Walker), 1946-|Washington (D.C.)|Football|2000-2010|Congress|Legislation|Intelligence|Republicans|Politics|Politicians|Power|Football players|Elephants|Presidents|Referees|Sports","Hut 1, hut 2, hut 3, hut 4, hut 5; Congress; Intelligence Bill","Duffy, Brian, 1955-",,"University of Iowa. Libraries. Special Collections Dept.",2004-11-30|2011-04,,"Educational use only, no other permissions given. Copyright to this digital object is owned by The Des Moines Register; it may not be downloaded, reproduced, or distributed without written permission. For more information, contact the Special Collections Department.","Editorial Cartoons of Brian Duffy; Des Moines Register Cartoonists|Papers of Brian Duffy|Des Moines Register",,English,"Still image|Editorial cartoons",MSC916|duffy-041130|http://digital.lib.uiowa.edu/cdm/ref/collection/duffy/id/134,,,,,,,,,,,,,,,,,,,,,,,,,,,,,,,,,,,,,,,,,,,,,,,,"<a href=""http://digital.lib.uiowa.edu/cdm/ref/collection/duffy/id/134"" target=""_blank"">View this item in its source respository</a>",,,,,,,,,,,,,,,,,,,,,,,,,,,,,http://www.iowaheritage.org/files/original/dc9066d8514bf15be8b852fad6425909.jpg,"Remote Item","Editorial Cartoons of Brian Duffy",1,0
64297,http://www.iowaheritage.org/items/show/64297,"All of you House Republicans who voted to change the rules allowing an indicted majority leader to retain his seat, show yourselves!","Congress|DeLay, Tom D., 1947-|Washington (D.C.)|Men|2000-2010|Criminals|Crimes and punishment|Legislators|Politicians|Politics|Republicans|Political parties|Campaign funding|Money|Money -- United States|Investigations|Flashlights|Darkness|Eyes|Cockroaches",,"Duffy, Brian, 1955-",,"University of Iowa. Libraries. Special Collections Dept.",2004-11-19|2011-04,,"Educational use only, no other permissions given. Copyright to this digital object is owned by The Des Moines Register; it may not be downloaded, reproduced, or distributed without written permission. For more information, contact the Special Collections Department.","Editorial Cartoons of Brian Duffy; Des Moines Register Cartoonists|Papers of Brian Duffy|Des Moines Register",,English,"Still image|Editorial cartoons",MSC916|duffy-041119|http://digital.lib.uiowa.edu/cdm/ref/collection/duffy/id/135,,,,,,,,,,,,,,,,,,,,,,,,,,,,,,,,,,,,,,,,,,,,,,,,"<a href=""http://digital.lib.uiowa.edu/cdm/ref/collection/duffy/id/135"" target=""_blank"">View this item in its source respository</a>",,,,,,,,,,,,,,,,,,,,,,,,,,,,,http://www.iowaheritage.org/files/original/82c8b15171757625a05c302899302c19.jpg,"Remote Item","Editorial Cartoons of Brian Duffy",1,0
64359,http://www.iowaheritage.org/items/show/64359,"The state of the state","Governors|Branstad, Terry E.|Iowa|Governors|1980-1990|States|State governments|Democrats|Republicans|Partisanship|Parties|Party lines|Political parties|Politicians|Politics|Podiums|Speeches|Men|Fingers|Portraits|Papers",Democrats,"Duffy, Brian, 1955-",,"University of Iowa. Libraries. Special Collections Dept.",1986-01-14|2011-04,,"Educational use only, no other permissions given. Copyright to this digital object is owned by The Des Moines Register; it may not be downloaded, reproduced, or distributed without written permission. For more information, contact the Special Collections Department.","Editorial Cartoons of Brian Duffy; Des Moines Register Cartoonists|Papers of Brian Duffy|Des Moines Register",,English,"Still image|Editorial cartoons",MSC916|duffy-860114|http://digital.lib.uiowa.edu/cdm/ref/collection/duffy/id/197,,,,,,,,,,,,,,,,,,,,,,,,,,,,,,,,,,,,,,,,,,,,,,,,"<a href=""http://digital.lib.uiowa.edu/cdm/ref/collection/duffy/id/197"" target=""_blank"">View this item in its source respository</a>",,,,,,,,,,,,,,,,,,,,,,,,,,,,,http://www.iowaheritage.org/files/original/236cda54b518618dd3cbe26d25bf1637.jpg,"Remote Item","Editorial Cartoons of Brian Duffy",1,0
64398,http://www.iowaheritage.org/items/show/64398,"Now I know how the San Francisco Giants must have felt","Presidents|Bush, George, 1924-|Washington (D.C.)|Presidents|1980-1990|Presidents -- United States|Elections|Elections -- United States|Political parties|Democrats|Republicans|Flags|Desks|Offices|Telephones|Papers|Newspapers|Newspaper headlines|Windows","News; Democrats sweep elections N.V., New Jersey, Virginia; Wait; In","Duffy, Brian, 1955-",,"University of Iowa. Libraries. Special Collections Dept.",1989-11-09|2011-04,,"Educational use only, no other permissions given. Copyright to this digital object is owned by The Des Moines Register; it may not be downloaded, reproduced, or distributed without written permission. For more information, contact the Special Collections Department.","Editorial Cartoons of Brian Duffy; Des Moines Register Cartoonists|Papers of Brian Duffy|Des Moines Register",,English,"Still image|Editorial cartoons",MSC916|duffy-891109|http://digital.lib.uiowa.edu/cdm/ref/collection/duffy/id/236,,,,,,,,,,,,,,,,,,,,,,,,,,,,,,,,,,,,,,,,,,,,,,,,"<a href=""http://digital.lib.uiowa.edu/cdm/ref/collection/duffy/id/236"" target=""_blank"">View this item in its source respository</a>",,,,,,,,,,,,,,,,,,,,,,,,,,,,,http://www.iowaheritage.org/files/original/a5b24e4e5fe8e3975a6ce27f6e4e4b4a.jpg,"Remote Item","Editorial Cartoons of Brian Duffy",1,0
