 




﻿"Item Id","Item URI","Dublin Core:Title","Dublin Core:Subject","Dublin Core:Description","Dublin Core:Creator","Dublin Core:Source","Dublin Core:Publisher","Dublin Core:Date","Dublin Core:Contributor","Dublin Core:Rights","Dublin Core:Relation","Dublin Core:Format","Dublin Core:Language","Dublin Core:Type","Dublin Core:Identifier","Dublin Core:Coverage","Item Type Metadata:Text","Item Type Metadata:Interviewer","Item Type Metadata:Interviewee","Item Type Metadata:Location","Item Type Metadata:Transcription","Item Type Metadata:Local URL","Item Type Metadata:Original Format","Item Type Metadata:Physical Dimensions","Item Type Metadata:Duration","Item Type Metadata:Compression","Item Type Metadata:Producer","Item Type Metadata:Director","Item Type Metadata:Bit Rate/Frequency","Item Type Metadata:Time Summary","Item Type Metadata:Email Body","Item Type Metadata:Subject Line","Item Type Metadata:From","Item Type Metadata:To","Item Type Metadata:CC","Item Type Metadata:BCC","Item Type Metadata:Number of Attachments","Item Type Metadata:Standards","Item Type Metadata:Objectives","Item Type Metadata:Materials","Item Type Metadata:Lesson Plan Text","Item Type Metadata:URL","Item Type Metadata:Event Type","Item Type Metadata:Participants","Item Type Metadata:Birth Date","Item Type Metadata:Birthplace","Item Type Metadata:Death Date","Item Type Metadata:Occupation","Item Type Metadata:Biographical Text","Item Type Metadata:Bibliography","Item Type Metadata:Digital Reproduction Information","Item Type Metadata:Repository","Item Type Metadata:Repository Collection","Item Type Metadata:Contact information.","Item Type Metadata:File Name","Item Type Metadata:Notes","Item Type Metadata:Digital item created","Item Type Metadata:Digital item modified","Item Type Metadata:Executive Orders","Item Type Metadata:Record Created","Item Type Metadata:Record Modified","Item Type Metadata:Transcription2","Item Type Metadata:Source URL","Omeka Legacy File:Additional Creator","Omeka Legacy File:Transcriber","Omeka Legacy File:Producer","Omeka Legacy File:Render Device","Omeka Legacy File:Render Details","Omeka Legacy File:Capture Date","Omeka Legacy File:Capture Device","Omeka Legacy File:Capture Details","Omeka Legacy File:Change History","Omeka Legacy File:Watermark","Omeka Legacy File:Encryption","Omeka Legacy File:Compression","Omeka Legacy File:Post Processing","Omeka Image File:Width","Omeka Image File:Height","Omeka Image File:Bit Depth","Omeka Image File:Channels","Omeka Image File:Exif String","Omeka Image File:Exif Array","Omeka Image File:IPTC String","Omeka Image File:IPTC Array","Omeka Video File:Bitrate","Omeka Video File:Duration","Omeka Video File:Sample Rate","Omeka Video File:Codec","Omeka Video File:Width","Omeka Video File:Height",tags,file,itemType,collection,public,featured
35655,http://www.iowaheritage.org/items/show/35655,"Panel at Midwest Republican Leadership Conference, 1971","Women|Smith, Mary Louise|United States -- Indiana -- Indianapolis|1970-1980|Political conventions|Men|Voelker, Lawrence",,"Lacey, Ed",,"Ed Lacey, Jr. Photography|University of Iowa. Libraries. Iowa Women's Archives",1971|2007-09-13,,"Educational use only, no other permissions given. U.S. and international copyright laws may protect this item. Commercial use or distribution of this digital object is not permitted without written permission of the Iowa Women's Archives.","Iowa Women's Archives Founders|Mary Louise Smith Papers, 1914-1997|http://lib.uiowa.edu/collguides/?IWA0027|MLS et al, 1968-1972, misc.",jpeg,,"Still image|Photographs",IWA0027|https://digital.lib.uiowa.edu/,,,,,,,,,,,,,,,,,,,,,,,,,,,,,,,,,,,,,,,,,,,,,,,,"<a href=""https://digital.lib.uiowa.edu/"" target=""_blank"">View this item in its source respository</a>",,,,,,,,,,,,,,,,,,,,,,,,,,,,,http://www.iowaheritage.org/files/original/6c0d451edb46048489a8e6bc4287f434.jpg,"Remote Item","Iowa Women's Archives Founders",1,0
35667,http://www.iowaheritage.org/items/show/35667,"Pat and Bill Smith speaking with Mary Louise Smith at Midwest Republican Conference, Indianapolis, Indiana, 1971","Women|Smith, Mary Louise|United States -- Indiana -- Indianapolis|Men|Political conventions","Pat Smith was national committee woman from Nebraska","Lacey, Ed",,"Ed Lacey, Jr. Photography|University of Iowa. Libraries. Iowa Women's Archives",1971|2007-09-13,,"Educational use only, no other permissions given. U.S. and international copyright laws may protect this item. Commercial use or distribution of this digital object is not permitted without written permission of the Iowa Women's Archives.","Iowa Women's Archives Founders|Mary Louise Smith Papers, 1914-1997|http://lib.uiowa.edu/collguides/?IWA0027|MLS et al, 1968-1972, misc.",jpeg,,"Still image|Photographs",IWA0027|https://digital.lib.uiowa.edu/,,,,,,,,,,,,,,,,,,,,,,,,,,,,,,,,,,,,,,,,,,,,,,,,"<a href=""https://digital.lib.uiowa.edu/"" target=""_blank"">View this item in its source respository</a>",,,,,,,,,,,,,,,,,,,,,,,,,,,,,http://www.iowaheritage.org/files/original/6bff83ad130fa19677e5a947f3a61a77.jpg,"Remote Item","Iowa Women's Archives Founders",1,0
17593,http://www.iowaheritage.org/items/show/17593,"Sen. Bourke Hickenlooper, Charles Wittenmeyer, Anna Lomas, Charles Hoeven, Robert Ray, Evan ""Curly"" Hultman, Stu Charlton, and Sue Reed at the Republican National Convention, San Francisco, Calif., July, 1964","Activists|Hickenlooper, Bourke B. (Bourke Blakemore), 1896-1971|Republican National Convention (28th : 1964 : San Francisco, Calif.)|United States -- California -- San Francisco|1960-1970|Legislators|Politicians|Men|Women|Political conventions|Lomas, Anna Cochrane, b. 1896|Hoeven, Charles B. (Charles Bernard), 1895-1980|Ray, Robert D., 1928-|Hultman, Evan|Charlton, Stu|Wittenmeyer, Charles E., 1903-",,unknown,,"University of Iowa. Libraries. Iowa Women's Archives",1964-07|2007-09-13,,"Educational use only, no other permissions given. U.S. and international copyright laws may protect this item. Commercial use or distribution of this digital object is not permitted without written permission of the Iowa Women's Archives.","Iowa Women's Archives Founders|Mary Louise Smith Papers, 1914-1997|http://lib.uiowa.edu/collguides/?IWA0027|MLS et al., 1964-1966",jpeg,,"Still image|Photographs; Group portraits",IWA0027|https://digital.lib.uiowa.edu/,,,,,,,,,,,,,,,,,,,,,,,,,,,,,,,,,,,,,,,,,,,,,,,,"<a href=""https://digital.lib.uiowa.edu/"" target=""_blank"">View this item in its source respository</a>",,,,,,,,,,,,,,,,,,,,,,,,,,,,,http://www.iowaheritage.org/files/original/7765720dd75b678f69f037ea14a59ab7.jpg,"Remote Item","Iowa Women's Archives Founders",1,0
35651,http://www.iowaheritage.org/items/show/35651,"Women at the Republican Women's Conference, Washington, D.C., 1969","Women|Wilson, Genie|United States -- Washington (D.C.)|1960-1970|Political conventions|Ray, Billie|Brooks, Mary|Smith, Mary Louise",,unknown,,"Capitol and Glogau Photographers|University of Iowa. Libraries. Iowa Women's Archives",1969|2007-09-13,,"Educational use only, no other permissions given. U.S. and international copyright laws may protect this item. Commercial use or distribution of this digital object is not permitted without written permission of the Iowa Women's Archives.","Iowa Women's Archives Founders|Mary Louise Smith Papers, 1914-1997|http://lib.uiowa.edu/collguides/?IWA0027|MLS et al, 1968-1972, misc.",jpeg,,"Still image|Photographs",IWA0027|https://digital.lib.uiowa.edu/,,,,,,,,,,,,,,,,,,,,,,,,,,,,,,,,,,,,,,,,,,,,,,,,"<a href=""https://digital.lib.uiowa.edu/"" target=""_blank"">View this item in its source respository</a>",,,,,,,,,,,,,,,,,,,,,,,,,,,,,http://www.iowaheritage.org/files/original/033c3c5d91094101f1e2eb5b3a78c18b.jpg,"Remote Item","Iowa Women's Archives Founders",1,0
35658,http://www.iowaheritage.org/items/show/35658,"Group posed on the Capitol steps for the National Federation of Republican Women Convention, Washington, D.C., 1968","Women|National Federation of Republican Women|United States -- Washington (D.C.)|1960-1970|Political conventions",,unknown,,"University of Iowa. Libraries. Iowa Women's Archives",1968|2007-09-13,,"Educational use only, no other permissions given. U.S. and international copyright laws may protect this item. Commercial use or distribution of this digital object is not permitted without written permission of the Iowa Women's Archives.","Iowa Women's Archives Founders|Mary Louise Smith Papers, 1914-1997|http://lib.uiowa.edu/collguides/?IWA0027|MLS et al, 1968-1972, misc.",jpeg,,"Still image|Photographs",IWA0027|https://digital.lib.uiowa.edu/,,,,,,,,,,,,,,,,,,,,,,,,,,,,,,,,,,,,,,,,,,,,,,,,"<a href=""https://digital.lib.uiowa.edu/"" target=""_blank"">View this item in its source respository</a>",,,,,,,,,,,,,,,,,,,,,,,,,,,,,http://www.iowaheritage.org/files/original/c5f791c93885c144d4f3d30bd2a2028e.jpg,"Remote Item","Iowa Women's Archives Founders",1,0
35659,http://www.iowaheritage.org/items/show/35659,"Mary Louise Smith sitting in the Iowa delegation at Republican National Convention, Miami Beach, Fla., August 1972","Political conventions|Smith, Mary Louise|Republican National Convention (30th : 1972 : Miami Beach, Fla.)|United States -- Florida -- Miami Beach|1970-1980|Women|Men|Governors|Reagan, Ronald|Newsweek book","From Newsweek coverage",unknown,,"University of Iowa. Libraries. Iowa Women's Archives",1968-08|2007-09-13,,"Educational use only, no other permissions given. U.S. and international copyright laws may protect this item. Commercial use or distribution of this digital object is not permitted without written permission of the Iowa Women's Archives.","Iowa Women's Archives Founders|Mary Louise Smith Papers, 1914-1997|http://lib.uiowa.edu/collguides/?IWA0027|MLS et al, 1968-1972, misc.",jpeg,,"Still image|Photographs",IWA0027|https://digital.lib.uiowa.edu/,,,,,,,,,,,,,,,,,,,,,,,,,,,,,,,,,,,,,,,,,,,,,,,,"<a href=""https://digital.lib.uiowa.edu/"" target=""_blank"">View this item in its source respository</a>",,,,,,,,,,,,,,,,,,,,,,,,,,,,,http://www.iowaheritage.org/files/original/b7eeb9795a0122e643a7904ff3b85f66.jpg,"Remote Item","Iowa Women's Archives Founders",1,0
35665,http://www.iowaheritage.org/items/show/35665,"Mary Louise Smith speaking with gavel at national convention, Kansas City, Mo., August 1976","Women|Smith, Mary Louise|Republican National Convention (31st : 1976 : Kansas City, Mo.)|United States -- Missouri -- Kansas City|1970-1980|Political conventions|Public speaking",,unknown,,"University of Iowa. Libraries. Iowa Women's Archives",1976-08|2007-09-13,,"Educational use only, no other permissions given. U.S. and international copyright laws may protect this item. Commercial use or distribution of this digital object is not permitted without written permission of the Iowa Women's Archives.","Iowa Women's Archives Founders|Mary Louise Smith Papers, 1914-1997|http://lib.uiowa.edu/collguides/?IWA0027|1976- Republican National Convention, from commemorative scrapbook",jpeg,,"Still image|Photographs",IWA0027|https://digital.lib.uiowa.edu/,,,,,,,,,,,,,,,,,,,,,,,,,,,,,,,,,,,,,,,,,,,,,,,,"<a href=""https://digital.lib.uiowa.edu/"" target=""_blank"">View this item in its source respository</a>",,,,,,,,,,,,,,,,,,,,,,,,,,,,,http://www.iowaheritage.org/files/original/319942ac5658bb5f90c3454d8e80e5f0.jpg,"Remote Item","Iowa Women's Archives Founders",1,0
35691,http://www.iowaheritage.org/items/show/35691,"G.O.P. Women's Political Day banquet, 1976","Women|United States|1970-1980|Banquets|Banquet halls|Political conventions",,unknown,,"University of Iowa. Libraries. Iowa Women's Archives",1976|2007-09-13,,"Educational use only, no other permissions given. U.S. and international copyright laws may protect this item. Commercial use or distribution of this digital object is not permitted without written permission of the Iowa Women's Archives.","Iowa Women's Archives Founders|Mary Louise Smith Papers, 1914-1997|http://lib.uiowa.edu/collguides/?IWA0027|MLS at Women's Political Day, 1976",jpeg,,"Still image|Photographs",IWA0027|mls0191.jpg|https://digital.lib.uiowa.edu/,,,,,,,,,,,,,,,,,,,,,,,,,,,,,,,,,,,,,,,,,,,,,,,,"<a href=""https://digital.lib.uiowa.edu/"" target=""_blank"">View this item in its source respository</a>",,,,,,,,,,,,,,,,,,,,,,,,,,,,,http://www.iowaheritage.org/files/original/02b9b0988d264707df053138daa2eb9a.jpg,"Remote Item","Iowa Women's Archives Founders",1,0
35698,http://www.iowaheritage.org/items/show/35698,"Mary Louise Smith seated alone in Iowa delegate section, Republican National Convention, Miami Beach, Fla., August 1968","Women|Smith, Mary Louise|United States -- Florida -- Miami Beach|United States -- Florida -- Miami Beach|1960-1970|Political conventions",,unknown,,"University of Iowa. Libraries. Iowa Women's Archives",1968-08|2007-09-13,,"Educational use only, no other permissions given. U.S. and international copyright laws may protect this item. Commercial use or distribution of this digital object is not permitted without written permission of the Iowa Women's Archives.","Iowa Women's Archives Founders|Mary Louise Smith Papers, 1914-1997|http://lib.uiowa.edu/collguides/?IWA0027|MLS et al, 1968-1972, misc.",jpeg,,"Still image|Photographs",IWA0027|mls0325.jpg|https://digital.lib.uiowa.edu/,,,,,,,,,,,,,,,,,,,,,,,,,,,,,,,,,,,,,,,,,,,,,,,,"<a href=""https://digital.lib.uiowa.edu/"" target=""_blank"">View this item in its source respository</a>",,,,,,,,,,,,,,,,,,,,,,,,,,,,,http://www.iowaheritage.org/files/original/3e26bfe729d08dd972e1d07cfea46f36.jpg,"Remote Item","Iowa Women's Archives Founders",1,0
35699,http://www.iowaheritage.org/items/show/35699,"Governor Ronald Reagan speaking to Mary Louise Smith at Republican National Convention, Miami Beach, Fla., August 1972","Women|Smith, Mary Louise|Republican National Convention (30th : 1972 : Miami Beach, Fla.)|United States -- Florida -- Miami Beach|1960-1970|Political conventions|Governors|Reagan, Ronald|",,unknown,,"University of Iowa. Libraries. Iowa Women's Archives",1972-08|2007-09-13,,"Educational use only, no other permissions given. U.S. and international copyright laws may protect this item. Commercial use or distribution of this digital object is not permitted without written permission of the Iowa Women's Archives.","Iowa Women's Archives Founders|Mary Louise Smith Papers, 1914-1997|http://lib.uiowa.edu/collguides/?IWA0027|MLS et al, 1968-1972, misc.",jpeg,,"Still image|Photographs",IWA0027|mls0326.jpg|https://digital.lib.uiowa.edu/,,,,,,,,,,,,,,,,,,,,,,,,,,,,,,,,,,,,,,,,,,,,,,,,"<a href=""https://digital.lib.uiowa.edu/"" target=""_blank"">View this item in its source respository</a>",,,,,,,,,,,,,,,,,,,,,,,,,,,,,http://www.iowaheritage.org/files/original/b9b656d8804628473a9b099c9d06bd26.jpg,"Remote Item","Iowa Women's Archives Founders",1,0
