 




﻿"Item Id","Item URI","Dublin Core:Title","Dublin Core:Subject","Dublin Core:Description","Dublin Core:Creator","Dublin Core:Source","Dublin Core:Publisher","Dublin Core:Date","Dublin Core:Contributor","Dublin Core:Rights","Dublin Core:Relation","Dublin Core:Format","Dublin Core:Language","Dublin Core:Type","Dublin Core:Identifier","Dublin Core:Coverage","Item Type Metadata:Text","Item Type Metadata:Interviewer","Item Type Metadata:Interviewee","Item Type Metadata:Location","Item Type Metadata:Transcription","Item Type Metadata:Local URL","Item Type Metadata:Original Format","Item Type Metadata:Physical Dimensions","Item Type Metadata:Duration","Item Type Metadata:Compression","Item Type Metadata:Producer","Item Type Metadata:Director","Item Type Metadata:Bit Rate/Frequency","Item Type Metadata:Time Summary","Item Type Metadata:Email Body","Item Type Metadata:Subject Line","Item Type Metadata:From","Item Type Metadata:To","Item Type Metadata:CC","Item Type Metadata:BCC","Item Type Metadata:Number of Attachments","Item Type Metadata:Standards","Item Type Metadata:Objectives","Item Type Metadata:Materials","Item Type Metadata:Lesson Plan Text","Item Type Metadata:URL","Item Type Metadata:Event Type","Item Type Metadata:Participants","Item Type Metadata:Birth Date","Item Type Metadata:Birthplace","Item Type Metadata:Death Date","Item Type Metadata:Occupation","Item Type Metadata:Biographical Text","Item Type Metadata:Bibliography","Item Type Metadata:Digital Reproduction Information","Item Type Metadata:Repository","Item Type Metadata:Repository Collection","Item Type Metadata:Contact information.","Item Type Metadata:File Name","Item Type Metadata:Notes","Item Type Metadata:Digital item created","Item Type Metadata:Digital item modified","Item Type Metadata:Executive Orders","Item Type Metadata:Record Created","Item Type Metadata:Record Modified","Item Type Metadata:Transcription2","Item Type Metadata:Source URL","Omeka Legacy File:Additional Creator","Omeka Legacy File:Transcriber","Omeka Legacy File:Producer","Omeka Legacy File:Render Device","Omeka Legacy File:Render Details","Omeka Legacy File:Capture Date","Omeka Legacy File:Capture Device","Omeka Legacy File:Capture Details","Omeka Legacy File:Change History","Omeka Legacy File:Watermark","Omeka Legacy File:Encryption","Omeka Legacy File:Compression","Omeka Legacy File:Post Processing","Omeka Image File:Width","Omeka Image File:Height","Omeka Image File:Bit Depth","Omeka Image File:Channels","Omeka Image File:Exif String","Omeka Image File:Exif Array","Omeka Image File:IPTC String","Omeka Image File:IPTC Array","Omeka Video File:Bitrate","Omeka Video File:Duration","Omeka Video File:Sample Rate","Omeka Video File:Codec","Omeka Video File:Width","Omeka Video File:Height",tags,file,itemType,collection,public,featured
31071,http://www.iowaheritage.org/items/show/31071,"Artwork display, The University of Iowa elementary school, 1930","Universities & colleges|Elementary schools|University of Iowa|United States -- Iowa -- Iowa City|1930-1940|Laboratory schools|Art|Decorative arts|University of Iowa. College of Education","The University Elementary School,established in 1915, was a laboratory or experimental school directed through the College of Education for the training of principals, superintendents and teachers. Along with the University High School, it was closed in 1972 due to lack of funding.","Kent, Frederick W. (Frederick Wallace), 1894-1984",,"University of Iowa. Libraries. University Archives",1930|2010-09-12,,"Educational use only, no other permissions given. U.S. and international copyright laws may protect this digital object. Commercial use or distribution of the object is not permitted without prior permission of the copyright holder.","Iowa City Town and Campus Scenes|Frederick W. Kent Collection of Photographs, 1866-2000|http://www.lib.uiowa.edu/collguides/?RG30.0001.01|Prints|Organizations|University Elementary School|University Elementary School|Scanned with Ricoh Aficio 3228C @ 600 ppi. Master image saved in TIFF format",,,"Still image|Photographs|jpeg",RG30.0001.01|index.cpd|https://digital.lib.uiowa.edu/,,,,,,,,,,,,,,,,,,,,,,,,,,,,,,,,,,,,,,,,,,,,,,,,"<a href=""https://digital.lib.uiowa.edu/"" target=""_blank"">View this item in its source respository</a>",,,,,,,,,,,,,,,,,,,,,,,,,,,,,http://www.iowaheritage.org/files/original/3948a46d4af3a6ae9f1a27ef0aeaaef9.jpg,"Remote Item","Iowa City Town and Campus Scenes",1,0
31072,http://www.iowaheritage.org/items/show/31072,"Artwork display, The University of Iowa elementary school, 1930","Universities & colleges|Elementary schools|University of Iowa|United States -- Iowa -- Iowa City|1930-1940|Laboratory schools|Art|Decorative arts|Sculpture|University of Iowa. College of Education","The University Elementary School,established in 1915, was a laboratory or experimental school directed through the College of Education for the training of principals, superintendents and teachers. Along with the University High School, it was closed in 1972 due to lack of funding.","Kent, Frederick W. (Frederick Wallace), 1894-1984",,"University of Iowa. Libraries. University Archives",1930|2010-09-12,,"Educational use only, no other permissions given. U.S. and international copyright laws may protect this digital object. Commercial use or distribution of the object is not permitted without prior permission of the copyright holder.","Iowa City Town and Campus Scenes|Frederick W. Kent Collection of Photographs, 1866-2000|http://www.lib.uiowa.edu/collguides/?RG30.0001.01|Prints|Organizations|University Elementary School|University Elementary School|Scanned with Ricoh Aficio 3228C @ 600 ppi. Master image saved in TIFF format",,,"Still image|Photographs|jpeg",RG30.0001.01|index.cpd|https://digital.lib.uiowa.edu/,,,,,,,,,,,,,,,,,,,,,,,,,,,,,,,,,,,,,,,,,,,,,,,,"<a href=""https://digital.lib.uiowa.edu/"" target=""_blank"">View this item in its source respository</a>",,,,,,,,,,,,,,,,,,,,,,,,,,,,,http://www.iowaheritage.org/files/original/04f4b0990c23e3a590a1a3fc242cd807.jpg,"Remote Item","Iowa City Town and Campus Scenes",1,0
31108,http://www.iowaheritage.org/items/show/31108,"Bulletin board display for first grade social science class, The University of Iowa elementary school, January 22, 1932","Universities & colleges|Elementary schools|University of Iowa|United States -- Iowa -- Iowa City|1930-1940|Laboratory schools|Posters|Bulletin Boards|University of Iowa. College of Education","The University Elementary School,established in 1915, was a laboratory or experimental school directed through the College of Education for the training of principals, superintendents and teachers. Along with the University High School, it was closed in 1972 due to lack of funding.","Kent, Frederick W. (Frederick Wallace), 1894-1984",,"University of Iowa. Libraries. University Archives",1932-01-22|2010-09-12,,"Educational use only, no other permissions given. U.S. and international copyright laws may protect this digital object. Commercial use or distribution of the object is not permitted without prior permission of the copyright holder.","Iowa City Town and Campus Scenes|Frederick W. Kent Collection of Photographs, 1866-2000|http://www.lib.uiowa.edu/collguides/?RG30.0001.01|Prints|Organizations|University Elementary School|University Elementary School|Scanned with Ricoh Aficio 3228C @ 600 ppi. Master image saved in TIFF format",4|6,,"Still image|Photographs|jpeg",RG30.0001.01|index.cpd|https://digital.lib.uiowa.edu/,,,,,,,,,,,,,,,,,,,,,,,,,,,,,,,,,,,,,,,,,,,,,,,,"<a href=""https://digital.lib.uiowa.edu/"" target=""_blank"">View this item in its source respository</a>",,,,,,,,,,,,,,,,,,,,,,,,,,,,,http://www.iowaheritage.org/files/original/2bb3d505efebf71d6b518a88b091f6ea.jpg,"Remote Item","Iowa City Town and Campus Scenes",1,0
31167,http://www.iowaheritage.org/items/show/31167,"Class lesson on agriculture, The University of Iowa elementary school, 1920s","Universities & colleges|Elementary schools|University of Iowa|United States -- Iowa -- Iowa City|1920-1930|Laboratory schools|Classrooms|Teachers|Students|School children|Agriculture|University of Iowa. College of Education|Old Dental Building (Iowa City, Iowa)","The University Elementary School,established in 1915, was a laboratory or experimental school directed through the College of Education for the training of principals, superintendents and teachers. Along with the University High School, it was closed in 1972 due to lack of funding.","Kent, Frederick W. (Frederick Wallace), 1894-1984",,"University of Iowa. Libraries. University Archives",1920/1929|2010-09-12,,"Educational use only, no other permissions given. U.S. and international copyright laws may protect this digital object. Commercial use or distribution of the object is not permitted without prior permission of the copyright holder.","Iowa City Town and Campus Scenes|Frederick W. Kent Collection of Photographs, 1866-2000|http://www.lib.uiowa.edu/collguides/?RG30.0001.01|Prints|Organizations|University Elementary School|University Elementary School|Scanned with Ricoh Aficio 3228C @ 600 ppi. Master image saved in TIFF format",,,"Still image|Photographs|jpeg",RG30.0001.01|index.cpd|https://digital.lib.uiowa.edu/,,,,,,,,,,,,,,,,,,,,,,,,,,,,,,,,,,,,,,,,,,,,,,,,"<a href=""https://digital.lib.uiowa.edu/"" target=""_blank"">View this item in its source respository</a>",,,,,,,,,,,,,,,,,,,,,,,,,,,,,http://www.iowaheritage.org/files/original/15fe12a5f8973d10d0d00fbb1503b091.jpg,"Remote Item","Iowa City Town and Campus Scenes",1,0
31238,http://www.iowaheritage.org/items/show/31238,"Classroom activities, The University of Iowa elementary school, April 22, 1927","Universities & colleges|Elementary schools|University of Iowa|United States -- Iowa -- Iowa City|1920-1930|Laboratory schools|Classrooms|Teachers|Students|School children|Reading|Writing|Woodworking|Sewing|University of Iowa. College of Education","The University Elementary School,established in 1915, was a laboratory or experimental school directed through the College of Education for the training of principals, superintendents and teachers. Along with the University High School, it was closed in 1972 due to lack of funding.","Kent, Frederick W. (Frederick Wallace), 1894-1984",,"University of Iowa. Libraries. University Archives",1927-04-22|2010-09-12,,"Educational use only, no other permissions given. U.S. and international copyright laws may protect this digital object. Commercial use or distribution of the object is not permitted without prior permission of the copyright holder.","Iowa City Town and Campus Scenes|Frederick W. Kent Collection of Photographs, 1866-2000|http://www.lib.uiowa.edu/collguides/?RG30.0001.01|Prints|Organizations|University Elementary School|University Elementary School|Scanned with Ricoh Aficio 3228C @ 600 ppi. Master image saved in TIFF format",,,"Still image|Photographs|jpeg",RG30.0001.01|index.cpd|https://digital.lib.uiowa.edu/,,,,,,,,,,,,,,,,,,,,,,,,,,,,,,,,,,,,,,,,,,,,,,,,"<a href=""https://digital.lib.uiowa.edu/"" target=""_blank"">View this item in its source respository</a>",,,,,,,,,,,,,,,,,,,,,,,,,,,,,http://www.iowaheritage.org/files/original/5b69234f8d65b8350d42321e3d36dfcd.jpg,"Remote Item","Iowa City Town and Campus Scenes",1,0
31170,http://www.iowaheritage.org/items/show/31170,"Classroom spinning and weaving demonstration, The University of Iowa elementary school, 1920s","Universities & colleges|Elementary schools|University of Iowa|United States -- Iowa -- Iowa City|1920-1930|Laboratory schools|Classrooms|Teachers|Students|School children|Spinning|Spinning apparatus|Weaving|University of Iowa. College of Education|Old Dental Building (Iowa City, Iowa)","The University Elementary School,established in 1915, was a laboratory or experimental school directed through the College of Education for the training of principals, superintendents and teachers. Along with the University High School, it was closed in 1972 due to lack of funding.","Kent, Frederick W. (Frederick Wallace), 1894-1984",,"University of Iowa. Libraries. University Archives",1920/1929|2010-09-12,,"Educational use only, no other permissions given. U.S. and international copyright laws may protect this digital object. Commercial use or distribution of the object is not permitted without prior permission of the copyright holder.","Iowa City Town and Campus Scenes|Frederick W. Kent Collection of Photographs, 1866-2000|http://www.lib.uiowa.edu/collguides/?RG30.0001.01|Prints|Organizations|University Elementary School|University Elementary School|Scanned with Ricoh Aficio 3228C @ 600 ppi. Master image saved in TIFF format",,,"Still image|Photographs|jpeg",RG30.0001.01|index.cpd|https://digital.lib.uiowa.edu/,,,,,,,,,,,,,,,,,,,,,,,,,,,,,,,,,,,,,,,,,,,,,,,,"<a href=""https://digital.lib.uiowa.edu/"" target=""_blank"">View this item in its source respository</a>",,,,,,,,,,,,,,,,,,,,,,,,,,,,,http://www.iowaheritage.org/files/original/d84c809d06a3965fa9342d5add5d134d.jpg,"Remote Item","Iowa City Town and Campus Scenes",1,0
31172,http://www.iowaheritage.org/items/show/31172,"Classroom spinning and weaving demonstration, The University of Iowa elementary school, 1920s","Universities & colleges|Elementary schools|University of Iowa|United States -- Iowa -- Iowa City|1920-1930|Laboratory schools|Classrooms|Teachers|Students|School children|Spinning|Spinning apparatus|Weaving|University of Iowa. College of Education|Old Dental Building (Iowa City, Iowa)","The University Elementary School,established in 1915, was a laboratory or experimental school directed through the College of Education for the training of principals, superintendents and teachers. Along with the University High School, it was closed in 1972 due to lack of funding.","Kent, Frederick W. (Frederick Wallace), 1894-1984",,"University of Iowa. Libraries. University Archives",1920/1929|2010-09-12,,"Educational use only, no other permissions given. U.S. and international copyright laws may protect this digital object. Commercial use or distribution of the object is not permitted without prior permission of the copyright holder.","Iowa City Town and Campus Scenes|Frederick W. Kent Collection of Photographs, 1866-2000|http://www.lib.uiowa.edu/collguides/?RG30.0001.01|Prints|Organizations|University Elementary School|University Elementary School|Scanned with Ricoh Aficio 3228C @ 600 ppi. Master image saved in TIFF format",,,"Still image|Photographs|jpeg",RG30.0001.01|index.cpd|https://digital.lib.uiowa.edu/,,,,,,,,,,,,,,,,,,,,,,,,,,,,,,,,,,,,,,,,,,,,,,,,"<a href=""https://digital.lib.uiowa.edu/"" target=""_blank"">View this item in its source respository</a>",,,,,,,,,,,,,,,,,,,,,,,,,,,,,http://www.iowaheritage.org/files/original/05d806d661d622da348e69d2a4d3eed3.jpg,"Remote Item","Iowa City Town and Campus Scenes",1,0
31163,http://www.iowaheritage.org/items/show/31163,"Classroom spinning demonstration, The University of Iowa elementary school, 1920s","Universities & colleges|Elementary schools|University of Iowa|United States -- Iowa -- Iowa City|1920-1930|Laboratory schools|Classrooms|Teachers|Students|School children|Spinning|Spinning apparatus|University of Iowa. College of Education|Old Dental Building (Iowa City, Iowa)","The University Elementary School,established in 1915, was a laboratory or experimental school directed through the College of Education for the training of principals, superintendents and teachers. Along with the University High School, it was closed in 1972 due to lack of funding.","Kent, Frederick W. (Frederick Wallace), 1894-1984",,"University of Iowa. Libraries. University Archives",1920/1929|2010-09-12,,"Educational use only, no other permissions given. U.S. and international copyright laws may protect this digital object. Commercial use or distribution of the object is not permitted without prior permission of the copyright holder.","Iowa City Town and Campus Scenes|Frederick W. Kent Collection of Photographs, 1866-2000|http://www.lib.uiowa.edu/collguides/?RG30.0001.01|Prints|Organizations|University Elementary School|University Elementary School|Scanned with Ricoh Aficio 3228C @ 600 ppi. Master image saved in TIFF format",,,"Still image|Photographs|jpeg",RG30.0001.01|index.cpd|https://digital.lib.uiowa.edu/,,,,,,,,,,,,,,,,,,,,,,,,,,,,,,,,,,,,,,,,,,,,,,,,"<a href=""https://digital.lib.uiowa.edu/"" target=""_blank"">View this item in its source respository</a>",,,,,,,,,,,,,,,,,,,,,,,,,,,,,http://www.iowaheritage.org/files/original/01a947e4d9bc65c79c515314869458c5.jpg,"Remote Item","Iowa City Town and Campus Scenes",1,0
31171,http://www.iowaheritage.org/items/show/31171,"Classroom spinning demonstration, The University of Iowa elementary school, 1920s","Universities & colleges|Elementary schools|University of Iowa|United States -- Iowa -- Iowa City|1920-1930|Laboratory schools|Classrooms|Teachers|Students|School children|Spinning|Spinning apparatus|University of Iowa. College of Education|Old Dental Building (Iowa City, Iowa)","The University Elementary School,established in 1915, was a laboratory or experimental school directed through the College of Education for the training of principals, superintendents and teachers. Along with the University High School, it was closed in 1972 due to lack of funding.","Kent, Frederick W. (Frederick Wallace), 1894-1984",,"University of Iowa. Libraries. University Archives",1920/1929|2010-09-12,,"Educational use only, no other permissions given. U.S. and international copyright laws may protect this digital object. Commercial use or distribution of the object is not permitted without prior permission of the copyright holder.","Iowa City Town and Campus Scenes|Frederick W. Kent Collection of Photographs, 1866-2000|http://www.lib.uiowa.edu/collguides/?RG30.0001.01|Prints|Organizations|University Elementary School|University Elementary School|Scanned with Ricoh Aficio 3228C @ 600 ppi. Master image saved in TIFF format",,,"Still image|Photographs|jpeg",RG30.0001.01|index.cpd|https://digital.lib.uiowa.edu/,,,,,,,,,,,,,,,,,,,,,,,,,,,,,,,,,,,,,,,,,,,,,,,,"<a href=""https://digital.lib.uiowa.edu/"" target=""_blank"">View this item in its source respository</a>",,,,,,,,,,,,,,,,,,,,,,,,,,,,,http://www.iowaheritage.org/files/original/0b2ed68070037ae0a200551c210e6575.jpg,"Remote Item","Iowa City Town and Campus Scenes",1,0
31069,http://www.iowaheritage.org/items/show/31069,"Elementary school students with bags of popcorn, The University of Iowa elementary school, April 22, 1927","Universities & colleges|Elementary schools|University of Iowa|United States -- Iowa -- Iowa City|1920-1930|Laboratory schools|Classrooms|Students|Popcorn|Bags|Baskets|School children|University of Iowa. College of Education","The University Elementary School,established in 1915, was a laboratory or experimental school directed through the College of Education for the training of principals, superintendents and teachers. Along with the University High School, it was closed in 1972 due to lack of funding.","Kent, Frederick W. (Frederick Wallace), 1894-1984",,"University of Iowa. Libraries. University Archives",1927-04-22|2010-09-12,,"Educational use only, no other permissions given. U.S. and international copyright laws may protect this digital object. Commercial use or distribution of the object is not permitted without prior permission of the copyright holder.","Iowa City Town and Campus Scenes|Frederick W. Kent Collection of Photographs, 1866-2000|http://www.lib.uiowa.edu/collguides/?RG30.0001.01|Prints|Organizations|University Elementary School|University Elementary School|Scanned with Ricoh Aficio 3228C @ 600 ppi. Master image saved in TIFF format",,,"Still image|Photographs|jpeg",RG30.0001.01|index.cpd|https://digital.lib.uiowa.edu/,,,,,,,,,,,,,,,,,,,,,,,,,,,,,,,,,,,,,,,,,,,,,,,,"<a href=""https://digital.lib.uiowa.edu/"" target=""_blank"">View this item in its source respository</a>",,,,,,,,,,,,,,,,,,,,,,,,,,,,,http://www.iowaheritage.org/files/original/c1eed6009b744b433bca39db4b4c8a1c.jpg,"Remote Item","Iowa City Town and Campus Scenes",1,0
