 




﻿"Item Id","Item URI","Dublin Core:Title","Dublin Core:Subject","Dublin Core:Description","Dublin Core:Creator","Dublin Core:Source","Dublin Core:Publisher","Dublin Core:Date","Dublin Core:Contributor","Dublin Core:Rights","Dublin Core:Relation","Dublin Core:Format","Dublin Core:Language","Dublin Core:Type","Dublin Core:Identifier","Dublin Core:Coverage","Item Type Metadata:Text","Item Type Metadata:Interviewer","Item Type Metadata:Interviewee","Item Type Metadata:Location","Item Type Metadata:Transcription","Item Type Metadata:Local URL","Item Type Metadata:Original Format","Item Type Metadata:Physical Dimensions","Item Type Metadata:Duration","Item Type Metadata:Compression","Item Type Metadata:Producer","Item Type Metadata:Director","Item Type Metadata:Bit Rate/Frequency","Item Type Metadata:Time Summary","Item Type Metadata:Email Body","Item Type Metadata:Subject Line","Item Type Metadata:From","Item Type Metadata:To","Item Type Metadata:CC","Item Type Metadata:BCC","Item Type Metadata:Number of Attachments","Item Type Metadata:Standards","Item Type Metadata:Objectives","Item Type Metadata:Materials","Item Type Metadata:Lesson Plan Text","Item Type Metadata:URL","Item Type Metadata:Event Type","Item Type Metadata:Participants","Item Type Metadata:Birth Date","Item Type Metadata:Birthplace","Item Type Metadata:Death Date","Item Type Metadata:Occupation","Item Type Metadata:Biographical Text","Item Type Metadata:Bibliography","Item Type Metadata:Digital Reproduction Information","Item Type Metadata:Repository","Item Type Metadata:Repository Collection","Item Type Metadata:Contact information.","Item Type Metadata:File Name","Item Type Metadata:Notes","Item Type Metadata:Digital item created","Item Type Metadata:Digital item modified","Item Type Metadata:Executive Orders","Item Type Metadata:Record Created","Item Type Metadata:Record Modified","Item Type Metadata:Transcription2","Item Type Metadata:Source URL","Omeka Legacy File:Additional Creator","Omeka Legacy File:Transcriber","Omeka Legacy File:Producer","Omeka Legacy File:Render Device","Omeka Legacy File:Render Details","Omeka Legacy File:Capture Date","Omeka Legacy File:Capture Device","Omeka Legacy File:Capture Details","Omeka Legacy File:Change History","Omeka Legacy File:Watermark","Omeka Legacy File:Encryption","Omeka Legacy File:Compression","Omeka Legacy File:Post Processing","Omeka Image File:Width","Omeka Image File:Height","Omeka Image File:Bit Depth","Omeka Image File:Channels","Omeka Image File:Exif String","Omeka Image File:Exif Array","Omeka Image File:IPTC String","Omeka Image File:IPTC Array","Omeka Video File:Bitrate","Omeka Video File:Duration","Omeka Video File:Sample Rate","Omeka Video File:Codec","Omeka Video File:Width","Omeka Video File:Height",tags,file,itemType,collection,public,featured
69387,http://www.iowaheritage.org/items/show/69387,"Young Norm Kirch","Kirch family|Children--Iowa--Dubuque|Chauffeur's house|Kirch, Norm, 1931- United States -- Iowa -- Dubuque County","Norm Kirch as boy seated in Chauffeur's houses.",unknown,,,unknown,"Four Mounds Foundation","This digital image may be used for educational purposes, as long as it is not altered in any way. No commercial reproduction or distribution of this file is permitted without permission. For permission to use the digital image, please contact:  office@fourmounds.org",,"1 photograph : b&w ; 3.5 x 4.25 in; jpeg",,"still image; photograph",,,,,,,,,,,,,,,,,,,,,,,,,,,,,,,,,,,,,"Photographs scanned using HP Scanjet 3500c scanner at 200 ppi, 24-bit depth.","Four Mounds Digital Collection",,,parc_127.jpg,,2006-06-19,,,,,,,,,,,,,,,,,,,,,,,,,,,,,,,,,,,http://www.iowaheritage.org/files/original/e462282868ec3d6401eff3e5f7bb8dd2.jpg,"Still Image","Four Mounds Digital Collection",1,0
69358,http://www.iowaheritage.org/items/show/69358,"Vidie, Norm and Denise, the dog sitting at table","Burden family|Kirch family|Kirch, Norm, 1931-|Lange, Viola R. (""Vidie"") (Burden), 1931-|Playhouses|Dogs|United States -- Iowa -- Dubuque County",,unknown,,,"c. 1936-1938","John N. Gronen","This digital image may be used for educational purposes, as long as it is not altered in any way. No commercial reproduction or distribution of this file is permitted without permission. For permission to use the digital image, please contact: office@fourmounds.org",,"1 photograph : b&w; 7 x 12 cm; jpeg",,"still image; photograph",,,,,,,,,,,,,,,,,,,,,,,,,,,,,,,,,,,,,"Photographs scanned using HP Scanjet 3500c scanner at 600ppi, 24-bit depth.","Four Mounds Digital Collection",,,parc_615.jpg,,2007-02-15,,,,,,,,,,,,,,,,,,,,,,,,,,,,,,,,,,,http://www.iowaheritage.org/files/original/0714b56d89ef6bc5c40701b64decc46d.jpg,"Still Image","Four Mounds Digital Collection",1,0
69297,http://www.iowaheritage.org/items/show/69297,"Leo Heitzman and Milton Kirch cooking in the White house kitchen","Heitzman Family|Kirch family|Heitzman, Leo, 1917-1992|Kirch, Milton, 1904-1968|White house|United States -- Iowa -- Dubuque County","View looks North",unknown,,,"c. 1956-12-19","John N. Gronen","This digital image may be used for educational purposes, as long as it is not altered in any way. No commercial reproduction or distribution of this file is permitted without permission. For permission to use the digital image, please contact: office@fourmounds.org",,"1 photograph : b&w ; 19 x 24 cm; jpeg",,"still image; photograph",,,,,,,,,,,,,,,,,,,,,,,,,,,,,,,,,,,,,"Photographs scanned using HP Scanjet 3500c scanner at 600ppi, 24-bit depth.","Four Mounds Digital Collection",,,parc_541.jpg,,2007-02-1,,,,,,,,,,,,,,,,,,,,,,,,,,,,,,,,,,,http://www.iowaheritage.org/files/original/fc9f014f8e86a3e0376c96142a5570b3.jpg,"Still Image","Four Mounds Digital Collection",1,0
50807,http://www.iowaheritage.org/items/show/50807,"Vidie Burden and Norm Kirch sitting on top of the Playhouse arbor","Burden family|United States -- Iowa -- Dubuque County|Kirch family|Kirch, Norm, 1931-|Lange, Viola R. (""Vidie"") (Burden), 1931-|","View looks South",Unknown,,,c.1937,"John N. Gronen","This digital image may be used for educational purposes, as long as it is not altered in any way. No commercial reproduction or distribution of this file is permitted without permission. For permission to use the digital image, please contact: office@fourmounds.org",,"1 photograph : b&w ; 5 x 8 cm|JPEG",,"Still Image; Photographs",,,,,,,,,,,,,,,,,,,,,,,,,,,,,,,,,,,,,"Photographs scanned using HP Scanjet 3500c scanner at 600ppi, 24-bit depth.",,"Four Mounds Digital Collection",,parc_478.jpg,,1/24/2007,,,,,,,,,,,,,,,,,,,,,,,,,,,,,,,,,,,http://www.iowaheritage.org/files/original/608c87e7237d348352122883da4b3b5d.jpg,"Still Image","Four Mounds Digital Collection",1,0
50798,http://www.iowaheritage.org/items/show/50798,"Children on hay wagon with horses behind barn","Barn|United States -- Iowa -- Dubuque County|Horses|Burden family|Heitzman family|Kirch family|Gronen, Winifred A. (""Frindy"") (Burden), 1927-1994|Lange, Viola R. (""Vidie"") (Burden), 1931-|Heitzman, Ray, 1923-1943|Kirch, Norm, 1931-","View looks Northeast, Photograph of children gathered on haywagon. Left to right: unknown man, unknown kid, unknown kid, Frindy Burden?, Vidie Burden, unknown kid, Norm Kirch, Ray Heitzman, unknown man",Unknown,,,"c. 1934-1935","John N. Gronen","This digital image may be used for educational purposes, as long as it is not altered in any way. No commercial reproduction or distribution of this file is permitted without permission. For permission to use the digital image, please contact: office@fourmounds.org",,"1 photograph : b&w ; 7 x 12 cm|JPEG",,"Still Image; Photographs",,,,,,,,,,,,,,,,,,,,,,,,,,,,,,,,,,,,,"Photographs scanned using HP Scanjet 3500c scanner at 600ppi, 24-bit depth.",,"Four Mounds Digital Collection",,parc_468.jpg,,1/23/2007,,,,,,,,,,,,,,,,,,,,,,,,,,,,,,,,,,,http://www.iowaheritage.org/files/original/fa5e3b8386ab901442d542ef116827d8.jpg,"Still Image","Four Mounds Digital Collection",1,0
50751,http://www.iowaheritage.org/items/show/50751,"Norm Kirch and Vidie Burden behind the barn","Barn|United State -- Iowa -- Dubuque County|Burden family|Kirch family|Kirch, Norm, 1931-|Lange, Viola R. (""Vidie"") (Burden), 1931-","View looks Northeast",Unknown,,,"c. 1933-1935","John N. Gronen","This digital image may be used for educational purposes, as long as it is not altered in any way. No commercial reproduction or distribution of this file is permitted without permission. For permission to use the digital image, please contact: office@fourmounds.org",,"1 photograph : b&w ; 7 x 12 cm|JPEG",,"Still Image; Photographs",,,,,,,,,,,,,,,,,,,,,,,,,,,,,,,,,,,,,"Photographs scanned using HP Scanjet 3500c scanner at 600ppi, 24-bit depth.",,"Four Mounds Digital Collection",,parc_421.jpg,,1/8/2007,,,,,,,,,,,,,,,,,,,,,,,,,,,,,,,,,,,http://www.iowaheritage.org/files/original/6c146bf2b482638727e8d0ba56b9f03f.jpg,"Still Image","Four Mounds Digital Collection",1,0
50670,http://www.iowaheritage.org/items/show/50670,"Woman and three girls","Kirch family|United States -- Iowa -- Dubuque County|Kirch, Norm, 1931-","Photograph of four people standing outdoors. From left to right: Ginny Kirch, Clara Kirch, Jannan Kirch and Norm Kirch at the front.",unknown,,,1938,"Four Mounds Foundation","This digital image may be used for educational purposes, as long as it is not altered in any way. No commercial reproduction or distribution of this file is permitted without permission. For permission to use the digital image, please contact:  office@fourmounds.org",,"1 photograph : col. ; 5.5 x 10.25 in|JPEG",,"Still Image; Photographs",,,,,,,,,,,,,,,,,,,,,,,,,,,,,,,,,,,,,"Photographs scanned using HP Scanjet 3500c scanner at 200 ppi, 24-bit depth.",,"Four Mounds Digital Collection",,parc_364.jpg,,6/23/2006,,,,,,,,,,,,,,,,,,,,,,,,,,,,,,,,,,,http://www.iowaheritage.org/files/original/f075f209da8a2de2884c7717cc655780.jpg,"Still Image","Four Mounds Digital Collection",1,0
50643,http://www.iowaheritage.org/items/show/50643,"Vidie and Norm holding kittens","Burden family|United States -- Iowa -- Dubuque County|Kirch family|Lange, Viola R. (""Vidie"") (Burden), 1931-|Kirch, Norm, 1931-|Barn","Vidie Burden and Norm Kirch sitting on steps to barn/garage holding kittens, looking north.",unknown,,,5/14/1935,"Four Mounds Foundation","This digital image may be used for educational purposes, as long as it is not altered in any way. No commercial reproduction or distribution of this file is permitted without permission. For permission to use the digital image, please contact:  office@fourmounds.org",,"1 photograph : b&w ; 2.5 x 3.5 in|JPEG",,"Still Image; Photographs",,,,,,,,,,,,,,,,,,,,,,,,,,,,,,,,,,,,,"Photographs scanned using HP Scanjet 3500c scanner at 200 ppi, 24-bit depth.",,"Four Mounds Digital Collection",,parc_337.jpg,,6/23/2006,,,,,,,,,,,,,,,,,,,,,,,,,,,,,,,,,,,http://www.iowaheritage.org/files/original/34495afa5fc8a210556540280f92cdc8.jpg,"Still Image","Four Mounds Digital Collection",1,0
50617,http://www.iowaheritage.org/items/show/50617,"Kids around buggy","Children--Iowa--Dubuque|United States -- Iowa -- Dubuque County|Buggies|Burden family|Lange, Viola R. (""Vidie"") (Burden), 1931-|Kirch family|Kirch, Norm, 1931-|Sullivan's property|Heitzman family","Photograph of children gathered around buggy wagon. Top row left to right: Jannan Kirch, Don Heitzman, unknown. Middle row: Sandy James, Eveyln Friedlein. Bottom row: Norm Kirch, Ginny Kirch, Vidie Burden.",unknown,,,unknown,"Four Mounds Foundation","This digital image may be used for educational purposes, as long as it is not altered in any way. No commercial reproduction or distribution of this file is permitted without permission. For permission to use the digital image, please contact:  office@fourmounds.org",,"1 photograph : b&w ; 2.5 x 3.5 in|JPEG",,"Still Image; Photographs",,,,,,,,,,,,,,,,,,,,,,,,,,,,,,,,,,,,,"Photographs scanned using HP Scanjet 3500c scanner at 200 ppi, 24-bit depth.",,"Four Mounds Digital Collection",,parc_309.jpg,,6/22/2006,,,,,,,,,,,,,,,,,,,,,,,,,,,,,,,,,,,http://www.iowaheritage.org/files/original/46b0b8d4502a09f1c05f765e5780322e.jpg,"Still Image","Four Mounds Digital Collection",1,0
50613,http://www.iowaheritage.org/items/show/50613,"Gathering portrait","Heitzman family|United States -- Iowa -- Dubuque County|Kirch family|Sullivan's property|Heitzman, Ray, 1923-1943|Heitzman, John, 1885-1976|Heitzman, Leo, 1917-1992|Kirch, Milton, 1904-1968|Lange, Viola R. (""Vidie"") (Burden), 1931-","Children seated, Left to right: Don Heitzman, Nan Kirch, Ray Heitzman, Ginny Kirch, Frindy Burden, Norm Kirch, Vidie Burden.            Adults kneeling, Left to right: Katherine ""Kay"" Sullivan (behind), Arlene Friedlein (front), Irene Kirch, Clara Kirch, Milton Kirch, Leo Heitzman.            Adults standing, Left to right: Unknown male (at far left), Hannah Driscoll (in hat), ""Ray"" (hidden), unknown female, unknown female, Miss Gibbs, unknown male (behind), unknown male, unknown female, Cletus Heitzman (behind), unknown female (front), Veronica Heitzman, John Heitzman (tie & suspenders), unknown.",unknown,,,9/6/1936,"Four Mounds Foundation","This digital image may be used for educational purposes, as long as it is not altered in any way. No commercial reproduction or distribution of this file is permitted without permission. For permission to use the digital image, please contact:  office@fourmounds.org",,"1 photograph : b&w ; 2.5 x 3.5 in|JPEG",,"Still Image; Photographs",,,,,,,,,,,,,,,,,,,,,,,,,,,,,,,,,,,,,"Photographs scanned using HP Scanjet 3500c scanner at 200 ppi, 24-bit depth.",,"Four Mounds Digital Collection",,parc_305.jpg,,6/22/2006,,,,,,,,,,,,,,,,,,,,,,,,,,,,,,,,,,,http://www.iowaheritage.org/files/original/122a369f32ddb981786a9a743d559fdd.jpg,"Still Image","Four Mounds Digital Collection",1,0
