 




﻿"Item Id","Item URI","Dublin Core:Title","Dublin Core:Subject","Dublin Core:Description","Dublin Core:Creator","Dublin Core:Source","Dublin Core:Publisher","Dublin Core:Date","Dublin Core:Contributor","Dublin Core:Rights","Dublin Core:Relation","Dublin Core:Format","Dublin Core:Language","Dublin Core:Type","Dublin Core:Identifier","Dublin Core:Coverage","Item Type Metadata:Text","Item Type Metadata:Interviewer","Item Type Metadata:Interviewee","Item Type Metadata:Location","Item Type Metadata:Transcription","Item Type Metadata:Local URL","Item Type Metadata:Original Format","Item Type Metadata:Physical Dimensions","Item Type Metadata:Duration","Item Type Metadata:Compression","Item Type Metadata:Producer","Item Type Metadata:Director","Item Type Metadata:Bit Rate/Frequency","Item Type Metadata:Time Summary","Item Type Metadata:Email Body","Item Type Metadata:Subject Line","Item Type Metadata:From","Item Type Metadata:To","Item Type Metadata:CC","Item Type Metadata:BCC","Item Type Metadata:Number of Attachments","Item Type Metadata:Standards","Item Type Metadata:Objectives","Item Type Metadata:Materials","Item Type Metadata:Lesson Plan Text","Item Type Metadata:URL","Item Type Metadata:Event Type","Item Type Metadata:Participants","Item Type Metadata:Birth Date","Item Type Metadata:Birthplace","Item Type Metadata:Death Date","Item Type Metadata:Occupation","Item Type Metadata:Biographical Text","Item Type Metadata:Bibliography","Item Type Metadata:Digital Reproduction Information","Item Type Metadata:Repository","Item Type Metadata:Repository Collection","Item Type Metadata:Contact information.","Item Type Metadata:File Name","Item Type Metadata:Notes","Item Type Metadata:Digital item created","Item Type Metadata:Digital item modified","Item Type Metadata:Executive Orders","Item Type Metadata:Record Created","Item Type Metadata:Record Modified","Item Type Metadata:Transcription2","Item Type Metadata:Source URL","Omeka Legacy File:Additional Creator","Omeka Legacy File:Transcriber","Omeka Legacy File:Producer","Omeka Legacy File:Render Device","Omeka Legacy File:Render Details","Omeka Legacy File:Capture Date","Omeka Legacy File:Capture Device","Omeka Legacy File:Capture Details","Omeka Legacy File:Change History","Omeka Legacy File:Watermark","Omeka Legacy File:Encryption","Omeka Legacy File:Compression","Omeka Legacy File:Post Processing","Omeka Image File:Width","Omeka Image File:Height","Omeka Image File:Bit Depth","Omeka Image File:Channels","Omeka Image File:Exif String","Omeka Image File:Exif Array","Omeka Image File:IPTC String","Omeka Image File:IPTC Array","Omeka Video File:Bitrate","Omeka Video File:Duration","Omeka Video File:Sample Rate","Omeka Video File:Codec","Omeka Video File:Width","Omeka Video File:Height",tags,file,itemType,collection,public,featured
68124,http://www.iowaheritage.org/items/show/68124,"""Bertha,"" July 3, 1908","Flowers|Holidays|Carter, Bertha|United States -- Iowa -- Clarksville|1900-1910","Flowers printed on postcard. The name Bertha has  been painted on by hand and  glitter has been added.<br><br>4th of July greeting to Bertha Carter from her teacher on back.",unknown,,"University of Iowa. Libraries. Iowa Women's Archives",1908-07-03|2006-11-03,,"Material in the public domain. No restrictions on use.","Noble Photographs|Noble Photograph collection|http://www.lib.uiowa.edu/collguides/?IWA0031",9|14,,"Still image; Text|Picture postcards; Correspondence|jpeg",IWA0031|160192410|http://digital.lib.uiowa.edu/cdm/ref/collection/noble/id/44,,,,,,,,,,,,,,,,,,,,,,,,,,,,,,,,,,,,,,,,,,,,,,,,"<a href=""http://digital.lib.uiowa.edu/cdm/ref/collection/noble/id/44"" target=""_blank"">View this item in its source respository</a>",,,,,,,,,,,,,,,,,,,,,,,,,,,,,http://www.iowaheritage.org/files/original/17823a99085f8619986388c6749226aa.jpg,"Remote Item","Mary Noble Historical Photograph Collection",1,0
68573,http://www.iowaheritage.org/items/show/68573,"""Easter greetings,"" 1910s","Flowers|Thompson, Sadie|United States -- Iowa -- Lamont|1910-1920",,unknown,,"University of Iowa. Libraries. Iowa Women's Archives",1910/1919|2007-07-10,,"Material in the public domain. No restrictions on use.","Noble Photographs|Noble Photograph collection|http://www.lib.uiowa.edu/collguides/?IWA0031",9|14,,"Still image; Text|Picture postcards; Easter cards|jpeg",IWA0031|160192410|http://digital.lib.uiowa.edu/cdm/ref/collection/noble/id/1329,,,,,,,,,,,,,,,,,,,,,,,,,,,,,,,,,,,,,,,,,,,,,,,,"<a href=""http://digital.lib.uiowa.edu/cdm/ref/collection/noble/id/1329"" target=""_blank"">View this item in its source respository</a>",,,,,,,,,,,,,,,,,,,,,,,,,,,,,http://www.iowaheritage.org/files/original/4523052d2644ec7539ea4165dea7b4f3.jpg,"Remote Item","Mary Noble Historical Photograph Collection",1,0
68113,http://www.iowaheritage.org/items/show/68113,"""Friendship is like flowers,"" February, 1920","Flowers|Friendship|Carter, Bertha|Schroeder, Jennie|United States -- Iowa -- Waverly|1920-1930","Get well card to Bertha Carter from Jennie Schroeder.",unknown,,"Friendly Greetings|University of Iowa. Libraries. Iowa Women's Archives",1920-02|2006-09-14,,"Material in the public domain. No restrictions on use.","Noble Photographs|Noble Photograph collection|http://www.lib.uiowa.edu/collguides/?IWA0031",9|14,,"Still image; Text|Picture postcards; Correspondence|jpeg",IWA0031|160192410|http://digital.lib.uiowa.edu/cdm/ref/collection/noble/id/8,,,,,,,,,,,,,,,,,,,,,,,,,,,,,,,,,,,,,,,,,,,,,,,,"<a href=""http://digital.lib.uiowa.edu/cdm/ref/collection/noble/id/8"" target=""_blank"">View this item in its source respository</a>",,,,,,,,,,,,,,,,,,,,,,,,,,,,,http://www.iowaheritage.org/files/original/729d42a58181b4c17db9ee7c4cae054a.jpg,"Remote Item","Mary Noble Historical Photograph Collection",1,0
68438,http://www.iowaheritage.org/items/show/68438,"""Greetings from Pittsburgh, Pa,"" November 4, 1907","Flowers|Jacobs, Hattie|Glick, Minnie|United States -- Iowa -- Des Moines|United States -- Pennsylvania -- Pittsburgh|1900-1910",,unknown,,"University of Iowa. Libraries. Iowa Women's Archives",1907-11-04|2007-07-10,,"Material in the public domain. No restrictions on use.","Noble Photographs|Noble Photograph collection|http://www.lib.uiowa.edu/collguides/?IWA0031",14|9,,"Still image; Text|Picture postcards; Correspondence|jpeg",IWA0031|160192410|http://digital.lib.uiowa.edu/cdm/ref/collection/noble/id/1068,,,,,,,,,,,,,,,,,,,,,,,,,,,,,,,,,,,,,,,,,,,,,,,,"<a href=""http://digital.lib.uiowa.edu/cdm/ref/collection/noble/id/1068"" target=""_blank"">View this item in its source respository</a>",,,,,,,,,,,,,,,,,,,,,,,,,,,,,http://www.iowaheritage.org/files/original/0c1f62badd9a1b0ccea0a742d90422f6.jpg,"Remote Item","Mary Noble Historical Photograph Collection",1,0
68112,http://www.iowaheritage.org/items/show/68112,"""Just a birthday remembrance is all,"" September 18, 1915","Flowers|Carter, Bertha|United States -- Iowa -- Charles City|1910-1920","Birthday greeting from Gertie [?] to Bertha Carter.",unknown,,"Gibson Art Company|University of Iowa. Libraries. Iowa Women's Archives",1915-09-18|2006-09-14,,"Material in the public domain. No restrictions on use.","Noble Photographs|Noble Photograph collection|http://www.lib.uiowa.edu/collguides/?IWA0031",14|9,,"Still image; Text|Picture postcards; Correspondence|jpeg",IWA0031|160192410|http://digital.lib.uiowa.edu/cdm/ref/collection/noble/id/5,,,,,,,,,,,,,,,,,,,,,,,,,,,,,,,,,,,,,,,,,,,,,,,,"<a href=""http://digital.lib.uiowa.edu/cdm/ref/collection/noble/id/5"" target=""_blank"">View this item in its source respository</a>",,,,,,,,,,,,,,,,,,,,,,,,,,,,,http://www.iowaheritage.org/files/original/e4efbb4cd411135f8ad97767e89c245e.jpg,"Remote Item","Mary Noble Historical Photograph Collection",1,0
68349,http://www.iowaheritage.org/items/show/68349,"""My devoted heart is ever thine,"" 1900s","Birds|Flowers|Hearts (Symbols)|Sass, Elsie|Horshberger, Lena|United States -- Iowa -- Kalona|1900-1910",,unknown,,"University of Iowa. Libraries. Iowa Women's Archives",1900/1999|2007-02-01,,"Material in the public domain. No restrictions on use.","Noble Photographs|Noble Photograph collection|http://www.lib.uiowa.edu/collguides/?IWA0031",14|9,,"Still image; Text|Picture postcards; Valentines|jpeg",IWA0031|160192410|http://digital.lib.uiowa.edu/cdm/ref/collection/noble/id/786,,,,,,,,,,,,,,,,,,,,,,,,,,,,,,,,,,,,,,,,,,,,,,,,"<a href=""http://digital.lib.uiowa.edu/cdm/ref/collection/noble/id/786"" target=""_blank"">View this item in its source respository</a>",,,,,,,,,,,,,,,,,,,,,,,,,,,,,http://www.iowaheritage.org/files/original/7688cac8e869efb937375cbeea6a78c4.jpg,"Remote Item","Mary Noble Historical Photograph Collection",1,0
68347,http://www.iowaheritage.org/items/show/68347,"""My heart's gift,"" postcard, February 14, 1909","Flowers|Hearts (Symbols)|Pence, Cleo|Sayers, R. C.|United States -- Iowa -- Fairfield|1900-1910",,unknown,,"University of Iowa. Libraries. Iowa Women's Archives",1909-02-14|2007-02-01,,"Material in the public domain. No restrictions on use.","Noble Photographs|Noble Photograph collection|http://www.lib.uiowa.edu/collguides/?IWA0031",14|9,,"Still image; Text|Picture postcards;  Correspondence; Valentines|jpeg",IWA0031|160192410|http://digital.lib.uiowa.edu/cdm/ref/collection/noble/id/780,,,,,,,,,,,,,,,,,,,,,,,,,,,,,,,,,,,,,,,,,,,,,,,,"<a href=""http://digital.lib.uiowa.edu/cdm/ref/collection/noble/id/780"" target=""_blank"">View this item in its source respository</a>",,,,,,,,,,,,,,,,,,,,,,,,,,,,,http://www.iowaheritage.org/files/original/a0be41cac7bfd68469888046fb1d00cd.jpg,"Remote Item","Mary Noble Historical Photograph Collection",1,0
68436,http://www.iowaheritage.org/items/show/68436,"""Please accept this little note,"" January 17, 1912","Flowers|Jacobs, Hattie|United States -- Pennsylvania -- Pittsburgh|United States -- Iowa -- Des Moines|1910-1920",,unknown,,"Desarts Studios|University of Iowa. Libraries. Iowa Women's Archives",1912-01-17|2007-07-10,,"Material in the public domain. No restrictions on use.","Noble Photographs|Noble Photograph collection|http://www.lib.uiowa.edu/collguides/?IWA0031",9|14,,"Still image; Text|Postcards; Correspondence|jpeg",IWA0031|160192410|http://digital.lib.uiowa.edu/cdm/ref/collection/noble/id/1059,,,,,,,,,,,,,,,,,,,,,,,,,,,,,,,,,,,,,,,,,,,,,,,,"<a href=""http://digital.lib.uiowa.edu/cdm/ref/collection/noble/id/1059"" target=""_blank"">View this item in its source respository</a>",,,,,,,,,,,,,,,,,,,,,,,,,,,,,http://www.iowaheritage.org/files/original/decb9be80ea76eb36fcf080319820680.jpg,"Remote Item","Mary Noble Historical Photograph Collection",1,0
68583,http://www.iowaheritage.org/items/show/68583,"""Reward of merit,"" 1910s","Flowers|Pansies|Schlopp, Beulah|Mason, Flora|United States -- Iowa -- Sioux Rapids|1910-1920",,unknown,,"University of Iowa. Libraries. Iowa Women's Archives",1910/1919|2007-07-10,,"Material in the public domain. No restrictions on use.","Noble Photographs|Noble Photograph collection|http://www.lib.uiowa.edu/collguides/?IWA0031",14|9,,"Still image; Text|Picture postcards|jpeg",IWA0031|160192410|http://digital.lib.uiowa.edu/cdm/ref/collection/noble/id/1344,,,,,,,,,,,,,,,,,,,,,,,,,,,,,,,,,,,,,,,,,,,,,,,,"<a href=""http://digital.lib.uiowa.edu/cdm/ref/collection/noble/id/1344"" target=""_blank"">View this item in its source respository</a>",,,,,,,,,,,,,,,,,,,,,,,,,,,,,http://www.iowaheritage.org/files/original/33c87e72b925dad55603b1cf7e7ab5d7.jpg,"Remote Item","Mary Noble Historical Photograph Collection",1,0
68346,http://www.iowaheritage.org/items/show/68346,"""Sincerest love,"" 1900s","Flowers|Slack, Ethel|Davis, Lucie|United States -- Iowa -- Seevers|United States -- Iowa -- Des Moines|1900-1910",,unknown,,"University of Iowa. Libraries. Iowa Women's Archives",1910/1919|2007-02-01,,"Material in the public domain. No restrictions on use.","Noble Photographs|Noble Photograph collection|http://www.lib.uiowa.edu/collguides/?IWA0031",9|14,,"Still image; Text|Picture postcards; Correspondence; Valentines|jpeg",IWA0031|160192410|http://digital.lib.uiowa.edu/cdm/ref/collection/noble/id/777,,,,,,,,,,,,,,,,,,,,,,,,,,,,,,,,,,,,,,,,,,,,,,,,"<a href=""http://digital.lib.uiowa.edu/cdm/ref/collection/noble/id/777"" target=""_blank"">View this item in its source respository</a>",,,,,,,,,,,,,,,,,,,,,,,,,,,,,http://www.iowaheritage.org/files/original/1a218062939937793cd84c0819592e7f.jpg,"Remote Item","Mary Noble Historical Photograph Collection",1,0
