 




﻿"Item Id","Item URI","Dublin Core:Title","Dublin Core:Subject","Dublin Core:Description","Dublin Core:Creator","Dublin Core:Source","Dublin Core:Publisher","Dublin Core:Date","Dublin Core:Contributor","Dublin Core:Rights","Dublin Core:Relation","Dublin Core:Format","Dublin Core:Language","Dublin Core:Type","Dublin Core:Identifier","Dublin Core:Coverage","Item Type Metadata:Text","Item Type Metadata:Interviewer","Item Type Metadata:Interviewee","Item Type Metadata:Location","Item Type Metadata:Transcription","Item Type Metadata:Local URL","Item Type Metadata:Original Format","Item Type Metadata:Physical Dimensions","Item Type Metadata:Duration","Item Type Metadata:Compression","Item Type Metadata:Producer","Item Type Metadata:Director","Item Type Metadata:Bit Rate/Frequency","Item Type Metadata:Time Summary","Item Type Metadata:Email Body","Item Type Metadata:Subject Line","Item Type Metadata:From","Item Type Metadata:To","Item Type Metadata:CC","Item Type Metadata:BCC","Item Type Metadata:Number of Attachments","Item Type Metadata:Standards","Item Type Metadata:Objectives","Item Type Metadata:Materials","Item Type Metadata:Lesson Plan Text","Item Type Metadata:URL","Item Type Metadata:Event Type","Item Type Metadata:Participants","Item Type Metadata:Birth Date","Item Type Metadata:Birthplace","Item Type Metadata:Death Date","Item Type Metadata:Occupation","Item Type Metadata:Biographical Text","Item Type Metadata:Bibliography","Item Type Metadata:Digital Reproduction Information","Item Type Metadata:Repository","Item Type Metadata:Repository Collection","Item Type Metadata:Contact information.","Item Type Metadata:File Name","Item Type Metadata:Notes","Item Type Metadata:Digital item created","Item Type Metadata:Digital item modified","Item Type Metadata:Executive Orders","Item Type Metadata:Record Created","Item Type Metadata:Record Modified","Item Type Metadata:Transcription2","Item Type Metadata:Source URL","Omeka Legacy File:Additional Creator","Omeka Legacy File:Transcriber","Omeka Legacy File:Producer","Omeka Legacy File:Render Device","Omeka Legacy File:Render Details","Omeka Legacy File:Capture Date","Omeka Legacy File:Capture Device","Omeka Legacy File:Capture Details","Omeka Legacy File:Change History","Omeka Legacy File:Watermark","Omeka Legacy File:Encryption","Omeka Legacy File:Compression","Omeka Legacy File:Post Processing","Omeka Image File:Width","Omeka Image File:Height","Omeka Image File:Bit Depth","Omeka Image File:Channels","Omeka Image File:Exif String","Omeka Image File:Exif Array","Omeka Image File:IPTC String","Omeka Image File:IPTC Array","Omeka Video File:Bitrate","Omeka Video File:Duration","Omeka Video File:Sample Rate","Omeka Video File:Codec","Omeka Video File:Width","Omeka Video File:Height",tags,file,itemType,collection,public,featured
10948,http://www.iowaheritage.org/items/show/10948,Plato,"Philosophers|Italy -- Bologna|2000-2010|Eyes|Globes|Light bulbs","Altered catalog cards with images of Plato.|I loved the card catalogs. While searching for my selected book, I would often find other books that looked interesting! I can't do that with the online catalogs!  I lament the demise of the card catalogs, for all the interesting books that I won't discover accidentally! Some of my early memories are of going to the small town near where I lived in the country and getting books from the library. The librarian's name was Nell and she lived across the street from my Grandmother. I thought Grandma was really lucky to live near the ""book lady."" Thus begin my life long love of books. My card catalog adventures came later, about junior high.","Sassi, Fabio",,"University of Iowa. Libraries. Special Collections Dept.",2005|2006-11-16|https://digital.lib.uiowa.edu/,,"Educational use only, no other permissions given. Copyright to this resource is held by the University of Iowa Libraries' Special Collections Department, and is provided here for educational purposes only. It may not be reproduced or distributed in any format without written permission of the Special Collections Department.","cARTalog|cARTalog Collection|http://www.lib.uiowa.edu/collguides/?MSC0859",jpeg|7.4|12.4,"eng; ger","Still image|Collages (Visual works)",173618284,,,,,,,,,,,,,,,,,,,,,,,,,,,,,,,,,,,,,,,,,,,,,,,,,,,,,,,,,,,,,,,,,,,,,,,,,,,,,,"Remote Item","African American Women in Iowa Collection",1,0
10967,http://www.iowaheritage.org/items/show/10967,"Apple of my eye","Eyes|United States -- Alabama -- Auburn|2000-2010|Apples","Collaged catalog card with colored pencil drawing, painting, sewing, and cutouts.","McCallen, Betsy",,"University of Iowa. Libraries. Special Collections Dept.; Auburn University",2005|2006-12-20|https://digital.lib.uiowa.edu/,,"Educational use only, no other permissions given. Copyright to this resource is held by the University of Iowa Libraries' Special Collections Department, and is provided here for educational purposes only. It may not be reproduced or distributed in any format without written permission of the Special Collections Department.","cARTalog|cARTalog Collection|http://www.lib.uiowa.edu/collguides/?MSC0859",jpeg|7.4|12.4,"eng; lat","Still image|Collages (Visual works)",173618284,,,,,,,,,,,,,,,,,,,,,,,,,,,,,,,,,,,,,,,,,,,,,,,,,,,,,,,,,,,,,,,,,,,,,,,,,,,,,,"Remote Item","African American Women in Iowa Collection",1,0
64556,http://www.iowaheritage.org/items/show/64556,"Our motto: as solid as the ground it's built on","Farms|United States|Buildings|1980-1990|Farmland|Farm support|Farm aid|Banks|Banking|Eyes|Hands|Gargoyles|Ruins|Doors","Federal Land Bank; Farmland values","Duffy, Brian, 1955-",,"University of Iowa. Libraries. Special Collections Dept.",1985-07-31|2011-04,,"Educational use only, no other permissions given. Copyright to this digital object is owned by The Des Moines Register; it may not be downloaded, reproduced, or distributed without written permission. For more information, contact the Special Collections Department.","Editorial Cartoons of Brian Duffy; Des Moines Register Cartoonists|Papers of Brian Duffy|Des Moines Register",,English,"Still image|Editorial cartoons",MSC916|duffy-850731|http://digital.lib.uiowa.edu/cdm/ref/collection/duffy/id/394,,,,,,,,,,,,,,,,,,,,,,,,,,,,,,,,,,,,,,,,,,,,,,,,"<a href=""http://digital.lib.uiowa.edu/cdm/ref/collection/duffy/id/394"" target=""_blank"">View this item in its source respository</a>",,,,,,,,,,,,,,,,,,,,,,,,,,,,,http://www.iowaheritage.org/files/original/013eaedb6721e9cfbcb977015660b39a.jpg,"Remote Item","Editorial Cartoons of Brian Duffy",1,0
64526,http://www.iowaheritage.org/items/show/64526,"Moderates not welcum","Conservatism|United States|Trees|1980-1990|Republican Party|Political parties|Factions|Tree limbs|Tree houses|Elephants|Signs|Eyes",,"Duffy, Brian, 1955-",,"University of Iowa. Libraries. Special Collections Dept.",1984-08-27|2011-04,,"Educational use only, no other permissions given. Copyright to this digital object is owned by The Des Moines Register; it may not be downloaded, reproduced, or distributed without written permission. For more information, contact the Special Collections Department.","Editorial Cartoons of Brian Duffy; Des Moines Register Cartoonists|Papers of Brian Duffy|Des Moines Register",,English,"Still image|Editorial cartoons",MSC916|duffy-840827|http://digital.lib.uiowa.edu/cdm/ref/collection/duffy/id/364,,,,,,,,,,,,,,,,,,,,,,,,,,,,,,,,,,,,,,,,,,,,,,,,"<a href=""http://digital.lib.uiowa.edu/cdm/ref/collection/duffy/id/364"" target=""_blank"">View this item in its source respository</a>",,,,,,,,,,,,,,,,,,,,,,,,,,,,,http://www.iowaheritage.org/files/original/21163c7783945c3602608b6af40f7c43.jpg,"Remote Item","Editorial Cartoons of Brian Duffy",1,0
64480,http://www.iowaheritage.org/items/show/64480,"Anti-government extremists","Domestic violence|Oklahoma City (Okla.)|Oklahoma City Federal Building Bombing, Oklahoma City, Okla., 1995|Rocks|1990-2000|Terrorism|Violence|Bombing|Bombs|Federal government|Hatred|Government, Resistance to|Government|Eyes|Hiding|Buildings|Bomb craters|Footprints",,"Duffy, Brian, 1955-",,"University of Iowa. Libraries. Special Collections Dept.",1995-04-25|2011-04,,"Educational use only, no other permissions given. Copyright to this digital object is owned by The Des Moines Register; it may not be downloaded, reproduced, or distributed without written permission. For more information, contact the Special Collections Department.","Editorial Cartoons of Brian Duffy; Des Moines Register Cartoonists|Papers of Brian Duffy|Des Moines Register",,English,"Still image|Editorial cartoons",MSC916|duffy-950425|http://digital.lib.uiowa.edu/cdm/ref/collection/duffy/id/318,,,,,,,,,,,,,,,,,,,,,,,,,,,,,,,,,,,,,,,,,,,,,,,,"<a href=""http://digital.lib.uiowa.edu/cdm/ref/collection/duffy/id/318"" target=""_blank"">View this item in its source respository</a>",,,,,,,,,,,,,,,,,,,,,,,,,,,,,http://www.iowaheritage.org/files/original/44687a70e5eeabe238208ebe9e5594a6.jpg,"Remote Item","Editorial Cartoons of Brian Duffy",1,0
64297,http://www.iowaheritage.org/items/show/64297,"All of you House Republicans who voted to change the rules allowing an indicted majority leader to retain his seat, show yourselves!","Congress|DeLay, Tom D., 1947-|Washington (D.C.)|Men|2000-2010|Criminals|Crimes and punishment|Legislators|Politicians|Politics|Republicans|Political parties|Campaign funding|Money|Money -- United States|Investigations|Flashlights|Darkness|Eyes|Cockroaches",,"Duffy, Brian, 1955-",,"University of Iowa. Libraries. Special Collections Dept.",2004-11-19|2011-04,,"Educational use only, no other permissions given. Copyright to this digital object is owned by The Des Moines Register; it may not be downloaded, reproduced, or distributed without written permission. For more information, contact the Special Collections Department.","Editorial Cartoons of Brian Duffy; Des Moines Register Cartoonists|Papers of Brian Duffy|Des Moines Register",,English,"Still image|Editorial cartoons",MSC916|duffy-041119|http://digital.lib.uiowa.edu/cdm/ref/collection/duffy/id/135,,,,,,,,,,,,,,,,,,,,,,,,,,,,,,,,,,,,,,,,,,,,,,,,"<a href=""http://digital.lib.uiowa.edu/cdm/ref/collection/duffy/id/135"" target=""_blank"">View this item in its source respository</a>",,,,,,,,,,,,,,,,,,,,,,,,,,,,,http://www.iowaheritage.org/files/original/82c8b15171757625a05c302899302c19.jpg,"Remote Item","Editorial Cartoons of Brian Duffy",1,0
64226,http://www.iowaheritage.org/items/show/64226,Bioterrorism,"Bioterrorism|Poisons|2000-2010|Fear|Skull & crossbones|Corks|Eyes",,"Duffy, Brian, 1955-",,"University of Iowa. Libraries. Special Collections Dept.",2001-10-10|2011-04,,"Educational use only, no other permissions given. Copyright to this digital object is owned by The Des Moines Register; it may not be downloaded, reproduced, or distributed without written permission. For more information, contact the Special Collections Department.","Editorial Cartoons of Brian Duffy; Des Moines Register Cartoonists|Papers of Brian Duffy|Des Moines Register",,English,"Still image|Editorial cartoons",MSC916|duffy-011010|http://digital.lib.uiowa.edu/cdm/ref/collection/duffy/id/64,,,,,,,,,,,,,,,,,,,,,,,,,,,,,,,,,,,,,,,,,,,,,,,,"<a href=""http://digital.lib.uiowa.edu/cdm/ref/collection/duffy/id/64"" target=""_blank"">View this item in its source respository</a>",,,,,,,,,,,,,,,,,,,,,,,,,,,,,http://www.iowaheritage.org/files/original/4912895eba4e2a9d43d97bab903a75ae.jpg,"Remote Item","Editorial Cartoons of Brian Duffy",1,0
64224,http://www.iowaheritage.org/items/show/64224,"Broadened police powers","Police|United States|Men|2000-2010|Civil liberty|Freedom|Bill of Rights|Bill of Rights|Hand lenses|Eyes|Smoke|Hands","Careful; Bill of Rights","Duffy, Brian, 1955-",,"University of Iowa. Libraries. Special Collections Dept.",2001-10-04|2011-04,,"Educational use only, no other permissions given. Copyright to this digital object is owned by The Des Moines Register; it may not be downloaded, reproduced, or distributed without written permission. For more information, contact the Special Collections Department.","Editorial Cartoons of Brian Duffy; Des Moines Register Cartoonists|Papers of Brian Duffy|Des Moines Register",,English,"Still image|Editorial cartoons",MSC916|duffy-011004|http://digital.lib.uiowa.edu/cdm/ref/collection/duffy/id/62,,,,,,,,,,,,,,,,,,,,,,,,,,,,,,,,,,,,,,,,,,,,,,,,"<a href=""http://digital.lib.uiowa.edu/cdm/ref/collection/duffy/id/62"" target=""_blank"">View this item in its source respository</a>",,,,,,,,,,,,,,,,,,,,,,,,,,,,,http://www.iowaheritage.org/files/original/e5031fa4c46553385e16af3900b55fab.jpg,"Remote Item","Editorial Cartoons of Brian Duffy",1,0
64205,http://www.iowaheritage.org/items/show/64205,"Terrorist funding","Terrorism|United States|War on Terrorism, 2001-2009|Mouse traps|2000-2010|Funding|Government|War|Warfare|Tactics|Intelligence|Money bags|Eyes|Ball & chain|Traps",,"Duffy, Brian, 1955-",,"University of Iowa. Libraries. Special Collections Dept.",2001-09-25|2011-04,,"Educational use only, no other permissions given. Copyright to this digital object is owned by The Des Moines Register; it may not be downloaded, reproduced, or distributed without written permission. For more information, contact the Special Collections Department.","Editorial Cartoons of Brian Duffy; Des Moines Register Cartoonists|Papers of Brian Duffy|Des Moines Register",,English,"Still image|Editorial cartoons",MSC916|duffy-010925|http://digital.lib.uiowa.edu/cdm/ref/collection/duffy/id/43,,,,,,,,,,,,,,,,,,,,,,,,,,,,,,,,,,,,,,,,,,,,,,,,"<a href=""http://digital.lib.uiowa.edu/cdm/ref/collection/duffy/id/43"" target=""_blank"">View this item in its source respository</a>",,,,,,,,,,,,,,,,,,,,,,,,,,,,,http://www.iowaheritage.org/files/original/0b89e6134749ea29c5ede5b91e73e372.jpg,"Remote Item","Editorial Cartoons of Brian Duffy",1,0
64198,http://www.iowaheritage.org/items/show/64198,"Uncle Sam looking under rocks","Terrorism|September 11 Terrorist Attacks, 2001|Uncle Sam|2000-2010|Violence|Revenge|War|Wars|Uncle Sam--angry|Uncle Sam--foreboding|Uncle Sam--disgusted|Rocks|Smoke|Eyes|Deserts|Clubs",,"Duffy, Brian, 1955-",,"University of Iowa. Libraries. Special Collections Dept.",2001-09-14|2011-04,,"Educational use only, no other permissions given. Copyright to this digital object is owned by The Des Moines Register; it may not be downloaded, reproduced, or distributed without written permission. For more information, contact the Special Collections Department.","Editorial Cartoons of Brian Duffy; Des Moines Register Cartoonists|Papers of Brian Duffy|Des Moines Register",,English,"Still image|Editorial cartoons",MSC916|duffy-010914|http://digital.lib.uiowa.edu/cdm/ref/collection/duffy/id/36,,,,,,,,,,,,,,,,,,,,,,,,,,,,,,,,,,,,,,,,,,,,,,,,"<a href=""http://digital.lib.uiowa.edu/cdm/ref/collection/duffy/id/36"" target=""_blank"">View this item in its source respository</a>",,,,,,,,,,,,,,,,,,,,,,,,,,,,,http://www.iowaheritage.org/files/original/3c5b337b2bf33e6bbd5b691fda0319b4.jpg,"Remote Item","Editorial Cartoons of Brian Duffy",1,0
