 




﻿"Item Id","Item URI","Dublin Core:Title","Dublin Core:Subject","Dublin Core:Description","Dublin Core:Creator","Dublin Core:Source","Dublin Core:Publisher","Dublin Core:Date","Dublin Core:Contributor","Dublin Core:Rights","Dublin Core:Relation","Dublin Core:Format","Dublin Core:Language","Dublin Core:Type","Dublin Core:Identifier","Dublin Core:Coverage","Item Type Metadata:Text","Item Type Metadata:Interviewer","Item Type Metadata:Interviewee","Item Type Metadata:Location","Item Type Metadata:Transcription","Item Type Metadata:Local URL","Item Type Metadata:Original Format","Item Type Metadata:Physical Dimensions","Item Type Metadata:Duration","Item Type Metadata:Compression","Item Type Metadata:Producer","Item Type Metadata:Director","Item Type Metadata:Bit Rate/Frequency","Item Type Metadata:Time Summary","Item Type Metadata:Email Body","Item Type Metadata:Subject Line","Item Type Metadata:From","Item Type Metadata:To","Item Type Metadata:CC","Item Type Metadata:BCC","Item Type Metadata:Number of Attachments","Item Type Metadata:Standards","Item Type Metadata:Objectives","Item Type Metadata:Materials","Item Type Metadata:Lesson Plan Text","Item Type Metadata:URL","Item Type Metadata:Event Type","Item Type Metadata:Participants","Item Type Metadata:Birth Date","Item Type Metadata:Birthplace","Item Type Metadata:Death Date","Item Type Metadata:Occupation","Item Type Metadata:Biographical Text","Item Type Metadata:Bibliography","Item Type Metadata:Digital Reproduction Information","Item Type Metadata:Repository","Item Type Metadata:Repository Collection","Item Type Metadata:Contact information.","Item Type Metadata:File Name","Item Type Metadata:Notes","Item Type Metadata:Digital item created","Item Type Metadata:Digital item modified","Item Type Metadata:Executive Orders","Item Type Metadata:Record Created","Item Type Metadata:Record Modified","Item Type Metadata:Transcription2","Item Type Metadata:Source URL","Omeka Legacy File:Additional Creator","Omeka Legacy File:Transcriber","Omeka Legacy File:Producer","Omeka Legacy File:Render Device","Omeka Legacy File:Render Details","Omeka Legacy File:Capture Date","Omeka Legacy File:Capture Device","Omeka Legacy File:Capture Details","Omeka Legacy File:Change History","Omeka Legacy File:Watermark","Omeka Legacy File:Encryption","Omeka Legacy File:Compression","Omeka Legacy File:Post Processing","Omeka Image File:Width","Omeka Image File:Height","Omeka Image File:Bit Depth","Omeka Image File:Channels","Omeka Image File:Exif String","Omeka Image File:Exif Array","Omeka Image File:IPTC String","Omeka Image File:IPTC Array","Omeka Video File:Bitrate","Omeka Video File:Duration","Omeka Video File:Sample Rate","Omeka Video File:Codec","Omeka Video File:Width","Omeka Video File:Height",tags,file,itemType,collection,public,featured
16397,http://www.iowaheritage.org/items/show/16397,"Friendship memories of school days, 1933-1936","Students|Birkby, Evelyn|Prairie City High School (Prairie City, Iowa)|United States -- Iowa -- Prairie City|1930-1940|Schools|Christian vacation schools|Contests|Sports|Public speaking|Singing|Theatrical productions|Graduation ceremonies|Parties|Fairs|Carnivals|Travel|Racing|Waukee High School (Waukee, Iowa)|Sidney High School (Sidney, Iowa)|United States -- Iowa -- Waukee|United States -- Iowa -- Sidney","Scrapbook compiled by Evelyn Corrie (Birkby's maiden name); chronicles her high school years, which began in Prairie City, continued in Waukee, and ended with graduation from Sidney High School.","Birkby, Evelyn",,"University of Iowa. Libraries. Iowa Women's Archives",1930/1939|2010-10-10,,"Educational use only, no other permissions given. Copyright to this resource is held by Evelyn Birkby.  This resource may not be reproduced or distributed in any format without the written permission of Evelyn Birkby and the Iowa Women's Archives.","Evelyn Birkby Digital Collection; Iowa Women's Scrapbooks Digital Collection; Iowa Women's Archives Digital Collections|Evelyn Birkby Collection of Radio Homemaker Materials, 1919-2001|http://www.lib.uiowa.edu/findingaids/IWATitleDetail.aspx?CollectionIdentifier=IWA0126",jpeg,,"Still image; Text|Scrapbooks; Clippings (information artifacts); Memorabilia; Photographs; Programs (documents); Dance cards; Greeting cards; Invitations; Menus; Visiting cards; Autograph albums; Occasional poems; Ticket stubs; Envelopes",IWA0126|index.cpd|https://digital.lib.uiowa.edu/,,,,,,,,,,,,,,,,,,,,,,,,,,,,,,,,,,,,,,,,,,,,,,,,"<a href=""https://digital.lib.uiowa.edu/"" target=""_blank"">View this item in its source respository</a>",,,,,,,,,,,,,,,,,,,,,,,,,,,,,http://www.iowaheritage.org/files/original/95dbb9f539cf8ed71b48da8898701eec.jpg,"Remote Item","Evelyn Birkby Collection",1,0
23246,http://www.iowaheritage.org/items/show/23246,"Pole climbing competition west of Old Capitol, The University of Iowa, ca. 1905.","Utility poles|University of Iowa|United States -- Iowa -- Iowa City|1910-1920|Crowds|Climbing|Contests|Universities & colleges|Old Armory (Iowa City, Iowa)|Old Capitol (Iowa City, Iowa)","Building to the left is the University's first Armory located near the southwest corner of Old Capitol and later razed in 1923.","Kent, Frederick W. (Frederick Wallace), 1894-1984",,"University of Iowa. Libraries. University Archives",1905|2008-05,,"Educational use only, no other permissions given. U.S. and international copyright laws may protect this digital object. Commercial use or distribution of the object is not permitted without prior permission of the copyright holder.","Iowa City Town and Campus Scenes|Frederick W. Kent Collection of Photographs, 1866-2000|http://www.lib.uiowa.edu/collguides/?RG30.0001.01|Prints|Buildings|Old Armory; Old Capitol|Old Armory|Scanned with Ricoh Aficio 3228C at 600 ppi, full color. Master images saved in tiff format.",11|14,,"Still image|Photographs|jpeg",RG30.0001.01|ea0472.jpg|https://digital.lib.uiowa.edu/,,,,,,,,,,,,,,,,,,,,,,,,,,,,,,,,,,,,,,,,,,,,,,,,"<a href=""https://digital.lib.uiowa.edu/"" target=""_blank"">View this item in its source respository</a>",,,,,,,,,,,,,,,,,,,,,,,,,,,,,http://www.iowaheritage.org/files/original/7fca6bcf7bfdd6a6f4d5971ed5404dcd.jpg,"Remote Item","Iowa City Town and Campus Scenes",1,0
23429,http://www.iowaheritage.org/items/show/23429,"Fraternity brothers pushing a bed  in a race, The University of Iowa, 1970s","Men|University of Iowa|United States -- Iowa -- Iowa City|1970-1980|Fraternities & sororities|Beds|Contests|Universities & colleges",,"Kent, Frederick W. (Frederick Wallace), 1894-1984",,"University of Iowa. Libraries. University Archives",1970/1979,,"Educational use only, no other permissions given. U.S. and international copyright laws may protect this digital object. Commercial use or distribution of the object is not permitted without prior permission of the copyright holder.","Iowa City Town and Campus Scenes|Frederick W. Kent Collection of Photographs, 1866-2000|http://www.lib.uiowa.edu/collguides/?RG30.0001.01|Prints|Scanned with Ricoh Aficio 3228C @ 300 ppi, full color. Master images saved in tiff format.",13|18,,"Still image|Photographs|jpeg",RG30.0001.01|https://digital.lib.uiowa.edu/,,,,,,,,,,,,,,,,,,,,,,,,,,,,,,,,,,,,,,,,,,,,,,,,"<a href=""https://digital.lib.uiowa.edu/"" target=""_blank"">View this item in its source respository</a>",,,,,,,,,,,,,,,,,,,,,,,,,,,,,http://www.iowaheritage.org/files/original/91a42c20ee9ec0961297070deb17fc7c.jpg,"Remote Item","Iowa City Town and Campus Scenes",1,0
30947,http://www.iowaheritage.org/items/show/30947,"Tug of war international championship between Scottish Highlanders and Carroll Hawkeyes, The University of Iowa, October 27, 1977","Universities & colleges|University of Iowa|United States -- Iowa -- Iowa City|1970-1980|Tug of war|Pulling|Contests|University of Iowa. Scottish Highlanders","Dating back to 1936, the Scottish Highlanders was a student group dedicated to practicing and performing the Scottish arts of piping, drumming and dancing.","Kent, Frederick W. (Frederick Wallace), 1894-1984",,"University of Iowa. Libraries. University Archives",1977-10-27|2010-09-12,,"Educational use only, no other permissions given. U.S. and international copyright laws may protect this digital object. Commercial use or distribution of the object is not permitted without prior permission of the copyright holder.","Iowa City Town and Campus Scenes|Frederick W. Kent Collection of Photographs, 1866-2000|http://www.lib.uiowa.edu/collguides/?RG30.0001.01|Prints|Organizations|Scottish Highlanders|Scottish Highlanders|Scanned with Ricoh Aficio 3228C @ 600 ppi. Master image saved in TIFF format",,,"Still image|Photographs|jpeg",RG30.0001.01|index.cpd|https://digital.lib.uiowa.edu/,,,,,,,,,,,,,,,,,,,,,,,,,,,,,,,,,,,,,,,,,,,,,,,,"<a href=""https://digital.lib.uiowa.edu/"" target=""_blank"">View this item in its source respository</a>",,,,,,,,,,,,,,,,,,,,,,,,,,,,,http://www.iowaheritage.org/files/original/0c1445a9a1ab2c895cda2ef075f7efec.jpg,"Remote Item","Iowa City Town and Campus Scenes",1,0
31257,http://www.iowaheritage.org/items/show/31257,"Students ready to race at swim meet, The University of Iowa high school, March 1967","Universities & colleges|High schools|University of Iowa|United States -- Iowa -- Iowa City|1960-1970|Laboratory schools|Students|Swimmers|Swimming|Contests|University of Iowa. College of Education|University High School (Iowa City, Iowa)","The University High School was established in 1916 for grades 9-12 and grades 7 and 8 were added the following year. It was a laboratory or experimental school directed through the College of Education for the training of principals, superintendents and teachers. Along with the University Elementary School, it was closed in 1972 due to lack of funding.","Kent, Frederick W. (Frederick Wallace), 1894-1984",,"University of Iowa. Libraries. University Archives",1967-03|2010-09-12,,"Educational use only, no other permissions given. U.S. and international copyright laws may protect this digital object. Commercial use or distribution of the object is not permitted without prior permission of the copyright holder.","Iowa City Town and Campus Scenes|Frederick W. Kent Collection of Photographs, 1866-2000|http://www.lib.uiowa.edu/collguides/?RG30.0001.01|Prints|Organizations|University High School|University High School|Scanned with Ricoh Aficio 3228C @ 600 ppi. Master image saved in TIFF format",,,"Still image|Photographs|jpeg",RG30.0001.01|index.cpd|https://digital.lib.uiowa.edu/,,,,,,,,,,,,,,,,,,,,,,,,,,,,,,,,,,,,,,,,,,,,,,,,"<a href=""https://digital.lib.uiowa.edu/"" target=""_blank"">View this item in its source respository</a>",,,,,,,,,,,,,,,,,,,,,,,,,,,,,http://www.iowaheritage.org/files/original/d3364377dd9d2768ba50621070cd2a9c.jpg,"Remote Item","Iowa City Town and Campus Scenes",1,0
31258,http://www.iowaheritage.org/items/show/31258,"Student swimming at  meet, The University of Iowa high school, March  1967","Universities & colleges|High schools|University of Iowa|United States -- Iowa -- Iowa City|1960-1970|Laboratory schools|Students|Swimmers|Swimming|Swimming pools|Contests|University of Iowa. College of Education|University High School (Iowa City, Iowa)","The University High School was established in 1916 for grades 9-12 and grades 7 and 8 were added the following year. It was a laboratory or experimental school directed through the College of Education for the training of principals, superintendents and teachers. Along with the University Elementary School, it was closed in 1972 due to lack of funding.","Kent, Frederick W. (Frederick Wallace), 1894-1984",,"University of Iowa. Libraries. University Archives",1967-03|2010-09-12,,"Educational use only, no other permissions given. U.S. and international copyright laws may protect this digital object. Commercial use or distribution of the object is not permitted without prior permission of the copyright holder.","Iowa City Town and Campus Scenes|Frederick W. Kent Collection of Photographs, 1866-2000|http://www.lib.uiowa.edu/collguides/?RG30.0001.01|Prints|Organizations|University High School|University High School|Scanned with Ricoh Aficio 3228C @ 600 ppi. Master image saved in TIFF format",,,"Still image|Photographs|jpeg",RG30.0001.01|index.cpd|https://digital.lib.uiowa.edu/,,,,,,,,,,,,,,,,,,,,,,,,,,,,,,,,,,,,,,,,,,,,,,,,"<a href=""https://digital.lib.uiowa.edu/"" target=""_blank"">View this item in its source respository</a>",,,,,,,,,,,,,,,,,,,,,,,,,,,,,http://www.iowaheritage.org/files/original/62a0ea8f55af68ef340b9d99749972d9.jpg,"Remote Item","Iowa City Town and Campus Scenes",1,0
31260,http://www.iowaheritage.org/items/show/31260,"Students ready to race at swim meet, The University of Iowa high school, March  1967","Universities & colleges|High schools|University of Iowa|United States -- Iowa -- Iowa City|1960-1970|Laboratory schools|Students|Swimmers|Swimming|Contests|Referees|University of Iowa. College of Education|University High School (Iowa City, Iowa)","The University High School was established in 1916 for grades 9-12 and grades 7 and 8 were added the following year. It was a laboratory or experimental school directed through the College of Education for the training of principals, superintendents and teachers. Along with the University Elementary School, it was closed in 1972 due to lack of funding.","Kent, Frederick W. (Frederick Wallace), 1894-1984",,"University of Iowa. Libraries. University Archives",1967-03|2010-09-12,,"Educational use only, no other permissions given. U.S. and international copyright laws may protect this digital object. Commercial use or distribution of the object is not permitted without prior permission of the copyright holder.","Iowa City Town and Campus Scenes|Frederick W. Kent Collection of Photographs, 1866-2000|http://www.lib.uiowa.edu/collguides/?RG30.0001.01|Prints|Organizations|University High School|University High School|Scanned with Ricoh Aficio 3228C @ 600 ppi. Master image saved in TIFF format",,,"Still image|Photographs|jpeg",RG30.0001.01|index.cpd|https://digital.lib.uiowa.edu/,,,,,,,,,,,,,,,,,,,,,,,,,,,,,,,,,,,,,,,,,,,,,,,,"<a href=""https://digital.lib.uiowa.edu/"" target=""_blank"">View this item in its source respository</a>",,,,,,,,,,,,,,,,,,,,,,,,,,,,,http://www.iowaheritage.org/files/original/c0f574ae790a26b28a3c565a7b960c59.jpg,"Remote Item","Iowa City Town and Campus Scenes",1,0
31261,http://www.iowaheritage.org/items/show/31261,"Student preparing to dive at swim meet, The University of Iowa high school, March  1967","Universities & colleges|High schools|University of Iowa|United States -- Iowa -- Iowa City|1960-1970|Laboratory schools|Students|Swimmers|Contests|Diving|University of Iowa. College of Education|University High School (Iowa City, Iowa)","The University High School was established in 1916 for grades 9-12 and grades 7 and 8 were added the following year. It was a laboratory or experimental school directed through the College of Education for the training of principals, superintendents and teachers. Along with the University Elementary School, it was closed in 1972 due to lack of funding.","Kent, Frederick W. (Frederick Wallace), 1894-1984",,"University of Iowa. Libraries. University Archives",1967-03|2010-09-12,,"Educational use only, no other permissions given. U.S. and international copyright laws may protect this digital object. Commercial use or distribution of the object is not permitted without prior permission of the copyright holder.","Iowa City Town and Campus Scenes|Frederick W. Kent Collection of Photographs, 1866-2000|http://www.lib.uiowa.edu/collguides/?RG30.0001.01|Prints|Organizations|University High School|University High School|Scanned with Ricoh Aficio 3228C @ 600 ppi. Master image saved in TIFF format",,,"Still image|Photographs|jpeg",RG30.0001.01|index.cpd|https://digital.lib.uiowa.edu/,,,,,,,,,,,,,,,,,,,,,,,,,,,,,,,,,,,,,,,,,,,,,,,,"<a href=""https://digital.lib.uiowa.edu/"" target=""_blank"">View this item in its source respository</a>",,,,,,,,,,,,,,,,,,,,,,,,,,,,,http://www.iowaheritage.org/files/original/51212ea7750119f33de77a0d7deb1d70.jpg,"Remote Item","Iowa City Town and Campus Scenes",1,0
31262,http://www.iowaheritage.org/items/show/31262,"Student at swim meet, The University of Iowa high school, March 1967","Universities & colleges|High schools|University of Iowa|United States -- Iowa -- Iowa City|1960-1970|Laboratory schools|Students|Swimmers|Swimming|Contests|University of Iowa. College of Education|University High School (Iowa City, Iowa)","The University High School was established in 1916 for grades 9-12 and grades 7 and 8 were added the following year. It was a laboratory or experimental school directed through the College of Education for the training of principals, superintendents and teachers. Along with the University Elementary School, it was closed in 1972 due to lack of funding.","Kent, Frederick W. (Frederick Wallace), 1894-1984",,"University of Iowa. Libraries. University Archives",1967-03|2010-09-12,,"Educational use only, no other permissions given. U.S. and international copyright laws may protect this digital object. Commercial use or distribution of the object is not permitted without prior permission of the copyright holder.","Iowa City Town and Campus Scenes|Frederick W. Kent Collection of Photographs, 1866-2000|http://www.lib.uiowa.edu/collguides/?RG30.0001.01|Prints|Organizations|University High School|University High School|Scanned with Ricoh Aficio 3228C @ 600 ppi. Master image saved in TIFF format",,,"Still image|Photographs|jpeg",RG30.0001.01|index.cpd|https://digital.lib.uiowa.edu/,,,,,,,,,,,,,,,,,,,,,,,,,,,,,,,,,,,,,,,,,,,,,,,,"<a href=""https://digital.lib.uiowa.edu/"" target=""_blank"">View this item in its source respository</a>",,,,,,,,,,,,,,,,,,,,,,,,,,,,,http://www.iowaheritage.org/files/original/89cba434e14712cde337aae338119262.jpg,"Remote Item","Iowa City Town and Campus Scenes",1,0
31592,http://www.iowaheritage.org/items/show/31592,"Student diving at swim meet, The University of Iowa, March 1967","Universities & colleges|High schools|University of Iowa|United States -- Iowa -- Iowa City|1960-1970|Laboratory schools|Students|Diving|Swimmers|Contests|University of Iowa. College of Education|University High School (Iowa City, Iowa)","The University High School was established in 1916 for grades 9-12 and grades 7 and 8 were added the following year. It was a laboratory or experimental school directed through the College of Education for the training of principals, superintendents and teachers. Along with the University Elementary School, it was closed in 1972 due to lack of funding.","Kent, Frederick W. (Frederick Wallace), 1894-1984",,"University of Iowa. Libraries. University Archives",1967-03|2010-09-12,,"Educational use only, no other permissions given. U.S. and international copyright laws may protect this digital object. Commercial use or distribution of the object is not permitted without prior permission of the copyright holder.","Iowa City Town and Campus Scenes|Frederick W. Kent Collection of Photographs, 1866-2000|http://www.lib.uiowa.edu/collguides/?RG30.0001.01|Prints|Organizations|University High School|University High School|Scanned with Ricoh Aficio 3228C @ 600 ppi. Master image saved in TIFF format",,,"Still image|Photographs|jpeg",RG30.0001.01|org23-0043.jpg|https://digital.lib.uiowa.edu/,,,,,,,,,,,,,,,,,,,,,,,,,,,,,,,,,,,,,,,,,,,,,,,,"<a href=""https://digital.lib.uiowa.edu/"" target=""_blank"">View this item in its source respository</a>",,,,,,,,,,,,,,,,,,,,,,,,,,,,,http://www.iowaheritage.org/files/original/dbd6553577805561a6d1b8591a9d4ff9.jpg,"Remote Item","Iowa City Town and Campus Scenes",1,0
