 




﻿"Item Id","Item URI","Dublin Core:Title","Dublin Core:Subject","Dublin Core:Description","Dublin Core:Creator","Dublin Core:Source","Dublin Core:Publisher","Dublin Core:Date","Dublin Core:Contributor","Dublin Core:Rights","Dublin Core:Relation","Dublin Core:Format","Dublin Core:Language","Dublin Core:Type","Dublin Core:Identifier","Dublin Core:Coverage","Item Type Metadata:Text","Item Type Metadata:Interviewer","Item Type Metadata:Interviewee","Item Type Metadata:Location","Item Type Metadata:Transcription","Item Type Metadata:Local URL","Item Type Metadata:Original Format","Item Type Metadata:Physical Dimensions","Item Type Metadata:Duration","Item Type Metadata:Compression","Item Type Metadata:Producer","Item Type Metadata:Director","Item Type Metadata:Bit Rate/Frequency","Item Type Metadata:Time Summary","Item Type Metadata:Email Body","Item Type Metadata:Subject Line","Item Type Metadata:From","Item Type Metadata:To","Item Type Metadata:CC","Item Type Metadata:BCC","Item Type Metadata:Number of Attachments","Item Type Metadata:Standards","Item Type Metadata:Objectives","Item Type Metadata:Materials","Item Type Metadata:Lesson Plan Text","Item Type Metadata:URL","Item Type Metadata:Event Type","Item Type Metadata:Participants","Item Type Metadata:Birth Date","Item Type Metadata:Birthplace","Item Type Metadata:Death Date","Item Type Metadata:Occupation","Item Type Metadata:Biographical Text","Item Type Metadata:Bibliography","Item Type Metadata:Digital Reproduction Information","Item Type Metadata:Repository","Item Type Metadata:Repository Collection","Item Type Metadata:Contact information.","Item Type Metadata:File Name","Item Type Metadata:Notes","Item Type Metadata:Digital item created","Item Type Metadata:Digital item modified","Item Type Metadata:Executive Orders","Item Type Metadata:Record Created","Item Type Metadata:Record Modified","Item Type Metadata:Transcription2","Item Type Metadata:Source URL","Omeka Legacy File:Additional Creator","Omeka Legacy File:Transcriber","Omeka Legacy File:Producer","Omeka Legacy File:Render Device","Omeka Legacy File:Render Details","Omeka Legacy File:Capture Date","Omeka Legacy File:Capture Device","Omeka Legacy File:Capture Details","Omeka Legacy File:Change History","Omeka Legacy File:Watermark","Omeka Legacy File:Encryption","Omeka Legacy File:Compression","Omeka Legacy File:Post Processing","Omeka Image File:Width","Omeka Image File:Height","Omeka Image File:Bit Depth","Omeka Image File:Channels","Omeka Image File:Exif String","Omeka Image File:Exif Array","Omeka Image File:IPTC String","Omeka Image File:IPTC Array","Omeka Video File:Bitrate","Omeka Video File:Duration","Omeka Video File:Sample Rate","Omeka Video File:Codec","Omeka Video File:Width","Omeka Video File:Height",tags,file,itemType,collection,public,featured
21110,http://www.iowaheritage.org/items/show/21110,"Farm bureau favors legislation to accept displaced Europoeans in Iowa|Spokesman (Grundy Center, Iowa)|Displaced Persons","World War, 1939-1945 -- Refugees -- Iowa -- Grudndy Center|United States -- Iowa -- Grundy County -- Grundy Center|World War II",,,,"State Historical Society of Iowa, Iowa City","1948-02-28|1941;  1942;  1943;  1944;  1945;  1946;  1947;  1948;  1949;  1950|2006-03-24",,"This digital image may be used for educational purposes, as long as it is not altered in any way. No commercial reproduction or distribution of this file is permitted without written permission of the State Historical Society of Iowa.","World War II Iowa Press Clippings","image/jpeg; Display image: 365,040 bytes|1 clipping : b&w ; 13 x 6 cm.",eng,"Text; Clippings",1948-02-28.jpg|173848404|https://digital.lib.uiowa.edu/,,,,,,,,,,,,,,,,,,,,,,,,,,,,,,,,,,,,,,,,,,,,,,,,"<a href=""https://digital.lib.uiowa.edu/"" target=""_blank"">View this item in its source respository</a>",,,,,,,,,,,,,,,,,,,,,,,,,,,,,http://www.iowaheritage.org/files/original/90601cdf0aeea921729c992407fff5f0.jpg,"Remote Item","World War II Iowa Press Clippings",1,0
13965,http://www.iowaheritage.org/items/show/13965,"Grundy Center, Iowa. CRIP","Railroad stations|Chicago, Rock Island & Pacific Rail Road Co.|United States -- Iowa -- Grundy County -- Grundy Center|1950-1960|Buildings","Building with sign for Grundy Center. Grain bins around building.",unknown,,"University of Iowa. Libraries. Special Collections Dept.",1958-10-12|2005-02-17,,"Educational use only, no other permissions given. U.S. and international copyright laws may protect this digital image. Commercial use or distribution of the image is not permitted without prior permission of the copyright holder. For information see:  http://www.lib.uiowa.edu/spec-coll/help/copyright.html","John P. Vander Maas Railroadiana|John P. Vander Maas Railroadiana Collection|MSC0468|http://lib.uiowa.edu/collguides/?MSC0468|Vol. 42, Depots by county",8|11,,"Still image|Photographs|jpeg",42grundycenter01.jpg|169946290|https://digital.lib.uiowa.edu/,,,,,,,,,,,,,,,,,,,,,,,,,,,,,,,,,,,,,,,,,,,,,,,,"<a href=""https://digital.lib.uiowa.edu/"" target=""_blank"">View this item in its source respository</a>",,,,,,,,,,,,,,,,,,,,,,,,,,,,,http://www.iowaheritage.org/files/original/76ceddf36b5ca3e7d3d6818d13df5edc.jpg,"Remote Item","John P. Vander Maas Railroadiana",1,0
13966,http://www.iowaheritage.org/items/show/13966,"Grundy Center, Iowa. CRIP","Railroad stations|Chicago, Rock Island & Pacific Rail Road Co.|United States -- Iowa -- Grundy County -- Grundy Center|1950-1960|Buildings|Carriages & coaches|Railroad signals","Depot with sign for Grundy Center. Wooden cart next to depot. Railroad signal. Buildings in background.",unknown,,"University of Iowa. Libraries. Special Collections Dept.",1958-10-12|2005-02-17,,"Educational use only, no other permissions given. U.S. and international copyright laws may protect this digital image. Commercial use or distribution of the image is not permitted without prior permission of the copyright holder. For information see:  http://www.lib.uiowa.edu/spec-coll/help/copyright.html","John P. Vander Maas Railroadiana|John P. Vander Maas Railroadiana Collection|MSC0468|http://lib.uiowa.edu/collguides/?MSC0468|Vol. 42, Depots by county",7|12,,"Still image|Photographs|jpeg",42grundycenter02.jpg|169946290|https://digital.lib.uiowa.edu/,,,,,,,,,,,,,,,,,,,,,,,,,,,,,,,,,,,,,,,,,,,,,,,,"<a href=""https://digital.lib.uiowa.edu/"" target=""_blank"">View this item in its source respository</a>",,,,,,,,,,,,,,,,,,,,,,,,,,,,,http://www.iowaheritage.org/files/original/acba96df3e6c2e8e0442fedf9d893fb8.jpg,"Remote Item","John P. Vander Maas Railroadiana",1,0
14015,http://www.iowaheritage.org/items/show/14015,"Grundy Center, Iowa. CRIP","Railroad stations|Chicago, Rock Island & Pacific Rail Road Co.|United States -- Iowa -- Grundy County -- Grundy Center|1940-1950|Buildings|Automobiles|Railroad signals|Railroad cars","Two story depot with sign for Grundy Center. Automobiles parked next to depot. Train on railroad tracks. Railroad signal.",unknown,,"University of Iowa. Libraries. Special Collections Dept.",1940-04|2006-02-21,,"Educational use only, no other permissions given. U.S. and international copyright laws may protect this digital image. Commercial use or distribution of the image is not permitted without prior permission of the copyright holder. For information see:  http://www.lib.uiowa.edu/spec-coll/help/copyright.html","John P. Vander Maas Railroadiana|John P. Vander Maas Railroadiana Collection|MSC0468|http://lib.uiowa.edu/collguides/?MSC0468|Vol. 42, Depots by county",8|12,,"Still image|Photographs|jpeg",42grundycenter04.jpg|169946290|https://digital.lib.uiowa.edu/,,,,,,,,,,,,,,,,,,,,,,,,,,,,,,,,,,,,,,,,,,,,,,,,"<a href=""https://digital.lib.uiowa.edu/"" target=""_blank"">View this item in its source respository</a>",,,,,,,,,,,,,,,,,,,,,,,,,,,,,http://www.iowaheritage.org/files/original/63d2d4860337670c88f45219122e3bab.jpg,"Remote Item","John P. Vander Maas Railroadiana",1,0
13989,http://www.iowaheritage.org/items/show/13989,"Grundy Center, Iowa. RI","Railroad stations|Chicago, Rock Island & Pacific Rail Road Co.|United States -- Iowa -- Grundy County -- Grundy Center|1970-1980","Sign for Grundy Center on two metal posts. Grain bins and quonset buildings in background.",unknown,,"University of Iowa. Libraries. Special Collections Dept.",1978-10-27|2005-02-17,,"Educational use only, no other permissions given. U.S. and international copyright laws may protect this digital image. Commercial use or distribution of the image is not permitted without prior permission of the copyright holder. For information see:  http://www.lib.uiowa.edu/spec-coll/help/copyright.html","John P. Vander Maas Railroadiana|John P. Vander Maas Railroadiana Collection|MSC0468|http://lib.uiowa.edu/collguides/?MSC0468|Vol. 42, Depots by county",11|8,,"Still image|Photographs|jpeg",42grundycenter03.jpg|169946290|https://digital.lib.uiowa.edu/,,,,,,,,,,,,,,,,,,,,,,,,,,,,,,,,,,,,,,,,,,,,,,,,"<a href=""https://digital.lib.uiowa.edu/"" target=""_blank"">View this item in its source respository</a>",,,,,,,,,,,,,,,,,,,,,,,,,,,,,http://www.iowaheritage.org/files/original/3dc1777f14d4f55ffb2e33a958607c45.jpg,"Remote Item","John P. Vander Maas Railroadiana",1,0
23378,http://www.iowaheritage.org/items/show/23378,"More volunteer workers for surgical dressing class needed|Register (Grundy Center, Iowa)|Women's military activity","World War, 1939-1945 -- Participation, Female|United States -- Iowa -- Grundy County -- Grundy Center|World War II",,,,"State Historical Society of Iowa, Iowa City","1942-12-31|1941;  1942;  1943;  1944;  1945;  1946;  1947;  1948;  1949;  1950|2006-08-01",,"This digital image may be used for educational purposes, as long as it is not altered in any way. No commercial reproduction or distribution of this file is permitted without written permission of the State Historical Society of Iowa.","World War II Iowa Press Clippings","image/jpeg|1 clipping : b&w ; 9 x 5 cm.",eng,"Text; Clippings",1942-12-31-10.jpg|173848404|https://digital.lib.uiowa.edu/,,,,,,,,,,,,,,,,,,,,,,,,,,,,,,,,,,,,,,,,,,,,,,,,"<a href=""https://digital.lib.uiowa.edu/"" target=""_blank"">View this item in its source respository</a>",,,,,,,,,,,,,,,,,,,,,,,,,,,,,http://www.iowaheritage.org/files/original/f019e27140c317c22a8ef7233ef73d54.jpg,"Remote Item","World War II Iowa Press Clippings",1,0
24657,http://www.iowaheritage.org/items/show/24657,"Orchestra to play for WAACs|Register (Grundy Center, Iowa)|Women's military activity","United States. Army. Women's Army Auxiliary Corps|United States -- Iowa -- Polk County -- Fort Des Moines|World War II|World War, 1939-1945 -- Participation, Female|Women soldiers -- Iowa -- Fort Des Moines|United States -- Iowa -- Grundy County -- Grundy Center",,,,"State Historical Society of Iowa, Iowa City","1943-03-11|1941;  1942;  1943;  1944;  1945;  1946;  1947;  1948;  1949;  1950|2006-11-27",,"This digital image may be used for educational purposes, as long as it is not altered in any way. No commercial reproduction or distribution of this file is permitted without written permission of the State Historical Society of Iowa.","World War II Iowa Press Clippings","image/jpeg|1 clipping : b&w ; 5 x 5 cm.",eng,"Text; Clippings",1943-03-11-10.jpg|173848404|https://digital.lib.uiowa.edu/,,,,,,,,,,,,,,,,,,,,,,,,,,,,,,,,,,,,,,,,,,,,,,,,"<a href=""https://digital.lib.uiowa.edu/"" target=""_blank"">View this item in its source respository</a>",,,,,,,,,,,,,,,,,,,,,,,,,,,,,http://www.iowaheritage.org/files/original/5ca2042c65c5775e2ff6dbae6f27182b.jpg,"Remote Item","World War II Iowa Press Clippings",1,0
24544,http://www.iowaheritage.org/items/show/24544,"U.S. Navy needs volunteers for Waves|Register (Grundy Center, Iowa)|Women's military activity","United States. Naval Reserve. Women's Reserve|United States -- Iowa -- Grundy County -- Grundy Center|World War II|World War, 1939-1945 -- Participation, Female|Women soldiers -- Iowa|",,,,"State Historical Society of Iowa, Iowa City","1943-03-04|1941;  1942;  1943;  1944;  1945;  1946;  1947;  1948;  1949;  1950|2006-11-27",,"This digital image may be used for educational purposes, as long as it is not altered in any way. No commercial reproduction or distribution of this file is permitted without written permission of the State Historical Society of Iowa.","World War II Iowa Press Clippings","image/jpeg|1 clipping : b&w ; 10 x 5 cm.",eng,"Text; Clippings",1943-03-04-22.jpg|173848404|https://digital.lib.uiowa.edu/,,,,,,,,,,,,,,,,,,,,,,,,,,,,,,,,,,,,,,,,,,,,,,,,"<a href=""https://digital.lib.uiowa.edu/"" target=""_blank"">View this item in its source respository</a>",,,,,,,,,,,,,,,,,,,,,,,,,,,,,http://www.iowaheritage.org/files/original/976c114ae1cb95d0ebffd02e51899a76.jpg,"Remote Item","World War II Iowa Press Clippings",1,0
23639,http://www.iowaheritage.org/items/show/23639,"Waac office launched by Grundy Center Women's Club|Register (Grundy Center, Iowa)|Women's military activity","United States. Army. Women's Army Auxiliary Corps|United States -- Iowa -- Polk County -- Fort Des Moines|World War II|World War, 1939-1945 -- Participation, Female|Women soldiers -- Iowa -- Fort Des Moines|United States -- Iowa -- Grundy County -- Grundy Center",,,,"State Historical Society of Iowa, Iowa City","1943-01-21|1941;  1942;  1943;  1944;  1945;  1946;  1947;  1948;  1949;  1950|2006-09-15",,"This digital image may be used for educational purposes, as long as it is not altered in any way. No commercial reproduction or distribution of this file is permitted without written permission of the State Historical Society of Iowa.","World War II Iowa Press Clippings","image/jpeg|1 clipping : b&w ; 13 x 5 cm.",eng,"Text; Clippings",1943-01-21-11.jpg|173848404|https://digital.lib.uiowa.edu/,,,,,,,,,,,,,,,,,,,,,,,,,,,,,,,,,,,,,,,,,,,,,,,,"<a href=""https://digital.lib.uiowa.edu/"" target=""_blank"">View this item in its source respository</a>",,,,,,,,,,,,,,,,,,,,,,,,,,,,,http://www.iowaheritage.org/files/original/8c5ee8e41a439918463a1d5d94d4acb0.jpg,"Remote Item","World War II Iowa Press Clippings",1,0
22593,http://www.iowaheritage.org/items/show/22593,"WAAC officer addresses B.P.W. club|Register (Grundy Center, Iowa)|Women's military activity","United States. Army. Women's Army Auxiliary Corps|United States -- Iowa -- Grundy County -- Grundy Center|World War II|World War, 1939-1945 -- Participation, Female|Women soldiers -- Iowa -- Fort Des Moines",,,,"State Historical Society of Iowa, Iowa City","1942-10-15|1941;  1942;  1943;  1944;  1945;  1946;  1947;  1948;  1949;  1950|2006-07-10",,"This digital image may be used for educational purposes, as long as it is not altered in any way. No commercial reproduction or distribution of this file is permitted without written permission of the State Historical Society of Iowa.","World War II Iowa Press Clippings","image/jpeg|1 clipping : b&w ; 23 x 16 cm.",eng,"Text; Clippings",1942-10-15-01.jpg|173848404|https://digital.lib.uiowa.edu/,,,,,,,,,,,,,,,,,,,,,,,,,,,,,,,,,,,,,,,,,,,,,,,,"<a href=""https://digital.lib.uiowa.edu/"" target=""_blank"">View this item in its source respository</a>",,,,,,,,,,,,,,,,,,,,,,,,,,,,,http://www.iowaheritage.org/files/original/63ee2723b2a960f1867f193d25d851a1.jpg,"Remote Item","World War II Iowa Press Clippings",1,0
