 




﻿"Item Id","Item URI","Dublin Core:Title","Dublin Core:Subject","Dublin Core:Description","Dublin Core:Creator","Dublin Core:Source","Dublin Core:Publisher","Dublin Core:Date","Dublin Core:Contributor","Dublin Core:Rights","Dublin Core:Relation","Dublin Core:Format","Dublin Core:Language","Dublin Core:Type","Dublin Core:Identifier","Dublin Core:Coverage","Item Type Metadata:Text","Item Type Metadata:Interviewer","Item Type Metadata:Interviewee","Item Type Metadata:Location","Item Type Metadata:Transcription","Item Type Metadata:Local URL","Item Type Metadata:Original Format","Item Type Metadata:Physical Dimensions","Item Type Metadata:Duration","Item Type Metadata:Compression","Item Type Metadata:Producer","Item Type Metadata:Director","Item Type Metadata:Bit Rate/Frequency","Item Type Metadata:Time Summary","Item Type Metadata:Email Body","Item Type Metadata:Subject Line","Item Type Metadata:From","Item Type Metadata:To","Item Type Metadata:CC","Item Type Metadata:BCC","Item Type Metadata:Number of Attachments","Item Type Metadata:Standards","Item Type Metadata:Objectives","Item Type Metadata:Materials","Item Type Metadata:Lesson Plan Text","Item Type Metadata:URL","Item Type Metadata:Event Type","Item Type Metadata:Participants","Item Type Metadata:Birth Date","Item Type Metadata:Birthplace","Item Type Metadata:Death Date","Item Type Metadata:Occupation","Item Type Metadata:Biographical Text","Item Type Metadata:Bibliography","Item Type Metadata:Digital Reproduction Information","Item Type Metadata:Repository","Item Type Metadata:Repository Collection","Item Type Metadata:Contact information.","Item Type Metadata:File Name","Item Type Metadata:Notes","Item Type Metadata:Digital item created","Item Type Metadata:Digital item modified","Item Type Metadata:Executive Orders","Item Type Metadata:Record Created","Item Type Metadata:Record Modified","Item Type Metadata:Transcription2","Item Type Metadata:Source URL","Omeka Legacy File:Additional Creator","Omeka Legacy File:Transcriber","Omeka Legacy File:Producer","Omeka Legacy File:Render Device","Omeka Legacy File:Render Details","Omeka Legacy File:Capture Date","Omeka Legacy File:Capture Device","Omeka Legacy File:Capture Details","Omeka Legacy File:Change History","Omeka Legacy File:Watermark","Omeka Legacy File:Encryption","Omeka Legacy File:Compression","Omeka Legacy File:Post Processing","Omeka Image File:Width","Omeka Image File:Height","Omeka Image File:Bit Depth","Omeka Image File:Channels","Omeka Image File:Exif String","Omeka Image File:Exif Array","Omeka Image File:IPTC String","Omeka Image File:IPTC Array","Omeka Video File:Bitrate","Omeka Video File:Duration","Omeka Video File:Sample Rate","Omeka Video File:Codec","Omeka Video File:Width","Omeka Video File:Height",tags,file,itemType,collection,public,featured
64532,http://www.iowaheritage.org/items/show/64532,"Famous pirates through the ages","Oil|Pickens, T. Boone (Thomas Boone)|United States|Pirates|1980-1990|Oil industry|Piracy|Business|Business people|Money|Blackbeard, d. 1718|Captain James Hook (Fictitious character)|Texas|Swords|Briefcases|Hooks|Hats|Skull & crossbones|Barrels","Blackbeard; Captain Hook; T. Boone Pickens; Phillips; Gulf","Duffy, Brian, 1955-",,"University of Iowa. Libraries. Special Collections Dept.",1985-03-06|2011-04,,"Educational use only, no other permissions given. Copyright to this digital object is owned by The Des Moines Register; it may not be downloaded, reproduced, or distributed without written permission. For more information, contact the Special Collections Department.","Editorial Cartoons of Brian Duffy; Des Moines Register Cartoonists|Papers of Brian Duffy|Des Moines Register",,English,"Still image|Editorial cartoons",MSC916|duffy-850306|http://digital.lib.uiowa.edu/cdm/ref/collection/duffy/id/370,,,,,,,,,,,,,,,,,,,,,,,,,,,,,,,,,,,,,,,,,,,,,,,,"<a href=""http://digital.lib.uiowa.edu/cdm/ref/collection/duffy/id/370"" target=""_blank"">View this item in its source respository</a>",,,,,,,,,,,,,,,,,,,,,,,,,,,,,http://www.iowaheritage.org/files/original/795173ababc1e7621fd9170ba78f6ddf.jpg,"Remote Item","Editorial Cartoons of Brian Duffy",1,0
5803,http://www.iowaheritage.org/items/show/5803,"Good land!  What's the use of trying to clean house?","War|Post-World War, 1914-1918|Europe|Swords|peace|disarmament|guns|world.",,"Darling, Jay N. (Jay Norwood), 1876-1962","The Editorial cartoons of J.N. ""Ding"" Darling [electronic resource] : The Cowles Collection, Drake University, 1912-1962",,1926/06/19|1926,,"Copyright is owned by the ""Ding"" Darling Wildlife Society; it is administered on behalf of the Society by The University of Iowa. While use within the classroom is encouraged without specific authorization, publishing this cartoon in any format requires written permission. See policy and permissions procedure at: http://www.lib.uiowa.edu/spec-coll/services/dingdarling_fees.html","Cowles Library, Drake University, 2507 University Ave., Des Moines, IA 50311-4505.",,,,"260619.jpg|http://ddr.lib.drake.edu/u?/ddarling,2932",,,,,,,,,,,,,,,,,,,,,,,,,,,,,,,,,,,,,,,,,,,,,,,,"<a href=""http://ddr.lib.drake.edu/u?/ddarling,2932"" target=""_blank"">View this item in its source respository</a>",,,,,,,,,,,,,,,,,,,,,,,,,,,,,http://www.iowaheritage.org/files/original/3bfea1e92e6e24b56cddce28a9fabf1f.jpg,"Remote Item","Editorial Cartoons of J.N. ""Ding"" Darling, Drake University",1,0
9213,http://www.iowaheritage.org/items/show/9213,"Heavy, heavy hangs over thy head.","War|World War, 1939-1945|Russia|Swords|peace|international relations|treaties|United Nations|England|United States|blood|diplomats.",,"Darling, Jay N. (Jay Norwood), 1876-1962","The Editorial cartoons of J.N. ""Ding"" Darling [electronic resource] : The Cowles Collection, Drake University, 1912-1962",,1944/08/20|1944,,"Copyright is owned by the ""Ding"" Darling Wildlife Society; it is administered on behalf of the Society by The University of Iowa. While use within the classroom is encouraged without specific authorization, publishing this cartoon in any format requires written permission. See policy and permissions procedure at: http://www.lib.uiowa.edu/spec-coll/services/dingdarling_fees.html","Cowles Library, Drake University, 2507 University Ave., Des Moines, IA 50311-4505.",,,,"440820.jpg|http://ddr.lib.drake.edu/u?/ddarling,6143",,,,,,,,,,,,,,,,,,,,,,,,,,,,,,,,,,,,,,,,,,,,,,,,"<a href=""http://ddr.lib.drake.edu/u?/ddarling,6143"" target=""_blank"">View this item in its source respository</a>",,,,,,,,,,,,,,,,,,,,,,,,,,,,,http://www.iowaheritage.org/files/original/7c9567e9b60ec31ef1ec88c21235b564.jpg,"Remote Item","Editorial Cartoons of J.N. ""Ding"" Darling, Drake University",1,0
4397,http://www.iowaheritage.org/items/show/4397,"How about a little disarmament?","Government|Knox, Philander Chase, 1853-1921|Versailles, Treaty of, June 28, 1919 (Germany)|Swords|politics|international relations|treaties|Republican Party|Borah, William Edgar, 1865-1940|Brandegee, Frank Bosworth, 1864-1924|Johnson, Hiram Warren, 1866-1945|Harding, Warren G. (Warren Gamaliel), 1865-1923|Taft, William H. (William Howard), 1857-1930|Hughes, Charles Evans, 1862-1948|Hoover, Herbert, 1874-1964|axes.",,"Darling, Jay N. (Jay Norwood), 1876-1962","The Editorial cartoons of J.N. ""Ding"" Darling [electronic resource] : The Cowles Collection, Drake University, 1912-1962",,1921/01/03|1921,,"Copyright is owned by the ""Ding"" Darling Wildlife Society; it is administered on behalf of the Society by The University of Iowa. While use within the classroom is encouraged without specific authorization, publishing this cartoon in any format requires written permission. See policy and permissions procedure at: http://www.lib.uiowa.edu/spec-coll/services/dingdarling_fees.html","Cowles Library, Drake University, 2507 University Ave., Des Moines, IA 50311-4505.",,,,"210103.jpg|http://ddr.lib.drake.edu/u?/ddarling,1526",,,,,,,,,,,,,,,,,,,,,,,,,,,,,,,,,,,,,,,,,,,,,,,,"<a href=""http://ddr.lib.drake.edu/u?/ddarling,1526"" target=""_blank"">View this item in its source respository</a>",,,,,,,,,,,,,,,,,,,,,,,,,,,,,http://www.iowaheritage.org/files/original/0c0fec7a9a7fbfcf1c4bc1fa4accd2c0.jpg,"Remote Item","Editorial Cartoons of J.N. ""Ding"" Darling, Drake University",1,0
64191,http://www.iowaheritage.org/items/show/64191,"I plan on juggling blindfolded while balancing on one foot, here goes ...","Presidents|Bush, George W. (George Walker), 1946-|United States|Presidents|2000-2010|Issues|Politics|Reform|Blindfolds|Juggling|Torches|Swords|Axes|Saws|Clubs|Bombs","HMO reform; Military; Faith based initiative; Social Security; Education","Duffy, Brian, 1955-",,"University of Iowa. Libraries. Special Collections Dept.",2001-09-05|2011-04,,"Educational use only, no other permissions given. Copyright to this digital object is owned by The Des Moines Register; it may not be downloaded, reproduced, or distributed without written permission. For more information, contact the Special Collections Department.","Editorial Cartoons of Brian Duffy; Des Moines Register Cartoonists|Papers of Brian Duffy|Des Moines Register",,English,"Still image|Editorial cartoons",MSC916|duffy-010905|http://digital.lib.uiowa.edu/cdm/ref/collection/duffy/id/29,,,,,,,,,,,,,,,,,,,,,,,,,,,,,,,,,,,,,,,,,,,,,,,,"<a href=""http://digital.lib.uiowa.edu/cdm/ref/collection/duffy/id/29"" target=""_blank"">View this item in its source respository</a>",,,,,,,,,,,,,,,,,,,,,,,,,,,,,http://www.iowaheritage.org/files/original/f96dc3e9d6f011b006cd110a5aff9604.jpg,"Remote Item","Editorial Cartoons of Brian Duffy",1,0
4958,http://www.iowaheritage.org/items/show/4958,"Is the invasion of neutral territory any less of a crime than it was in 1914?","War|Greece|Swords|peace|aggression|militarism|Turkey|Dardanelles|Constantinople|Germany|Belgium|England|John Bull.",,"Darling, Jay N. (Jay Norwood), 1876-1962","The Editorial cartoons of J.N. ""Ding"" Darling [electronic resource] : The Cowles Collection, Drake University, 1912-1962",,1922/10/04|1922,,"Copyright is owned by the ""Ding"" Darling Wildlife Society; it is administered on behalf of the Society by The University of Iowa. While use within the classroom is encouraged without specific authorization, publishing this cartoon in any format requires written permission. See policy and permissions procedure at: http://www.lib.uiowa.edu/spec-coll/services/dingdarling_fees.html","Cowles Library, Drake University, 2507 University Ave., Des Moines, IA 50311-4505.",,,,"221004.jpg|http://ddr.lib.drake.edu/u?/ddarling,2087",,,,,,,,,,,,,,,,,,,,,,,,,,,,,,,,,,,,,,,,,,,,,,,,"<a href=""http://ddr.lib.drake.edu/u?/ddarling,2087"" target=""_blank"">View this item in its source respository</a>",,,,,,,,,,,,,,,,,,,,,,,,,,,,,http://www.iowaheritage.org/files/original/ff95ca54b16250e0fcb4316ccfeb81dc.jpg,"Remote Item","Editorial Cartoons of J.N. ""Ding"" Darling, Drake University",1,0
64635,http://www.iowaheritage.org/items/show/64635,"Isn't it interesting how history tends to repeat itself?","Foreign relations|Hussein, Saddam, 1937-2006|Iran|Dictators|1990-2000|History|Dictators|Pacts|Khomeini, Ruhollah|Hitler, Adolf, 1889-1945|Stalin, Joseph, 1879-1953|Iraq|Germany|Soviet Union|Men|Shaking hands|Swords","1939 Nazi-Soviet Pact","Duffy, Brian, 1955-",,"University of Iowa. Libraries. Special Collections Dept.",1990-08|2011-04,,"Educational use only, no other permissions given. Copyright to this digital object is owned by The Des Moines Register; it may not be downloaded, reproduced, or distributed without written permission. For more information, contact the Special Collections Department.","Editorial Cartoons of Brian Duffy; Des Moines Register Cartoonists|Papers of Brian Duffy|Des Moines Register",,English,"Still image|Editorial cartoons","MSC916|duffy-9008xx 3|http://digital.lib.uiowa.edu/cdm/ref/collection/duffy/id/473",,,,,,,,,,,,,,,,,,,,,,,,,,,,,,,,,,,,,,,,,,,,,,,,"<a href=""http://digital.lib.uiowa.edu/cdm/ref/collection/duffy/id/473"" target=""_blank"">View this item in its source respository</a>",,,,,,,,,,,,,,,,,,,,,,,,,,,,,http://www.iowaheritage.org/files/original/3c57e625fc2302529caabe673b4c7062.jpg,"Remote Item","Editorial Cartoons of Brian Duffy",1,0
6800,http://www.iowaheritage.org/items/show/6800,"Much longer than necessary.","War|MacDonald, James Ramsay, 1866-1937|United States|World|peace|armaments|disarmament|Hoover, Herbert, 1874-1964|England|Great Britain|World|warriors|swords|guns.",,"Darling, Jay N. (Jay Norwood), 1876-1962","The Editorial cartoons of J.N. ""Ding"" Darling [electronic resource] : The Cowles Collection, Drake University, 1912-1962",,1929/09/15|1929,,"Copyright is owned by the ""Ding"" Darling Wildlife Society; it is administered on behalf of the Society by The University of Iowa. While use within the classroom is encouraged without specific authorization, publishing this cartoon in any format requires written permission. See policy and permissions procedure at: http://www.lib.uiowa.edu/spec-coll/services/dingdarling_fees.html","Cowles Library, Drake University, 2507 University Ave., Des Moines, IA 50311-4505.",,,,"290915.jpg|http://ddr.lib.drake.edu/u?/ddarling,3814",,,,,,,,,,,,,,,,,,,,,,,,,,,,,,,,,,,,,,,,,,,,,,,,"<a href=""http://ddr.lib.drake.edu/u?/ddarling,3814"" target=""_blank"">View this item in its source respository</a>",,,,,,,,,,,,,,,,,,,,,,,,,,,,,http://www.iowaheritage.org/files/original/a666978d216a0e3809272fa8d9f44509.jpg,"Remote Item","Editorial Cartoons of J.N. ""Ding"" Darling, Drake University",1,0
64277,http://www.iowaheritage.org/items/show/64277,"To whom shall I grant knighthood?","Caucus|Harkin, Tom|Iowa|Senators|2000-2010|Democrats|Candidates|Endorsements|Presidency|Kings|Swords|Hay|Thrones|Flags|Banners|Pigs|Corn|Lists","Endorsement; Harkin; The caucus king; Dean Gephardt Kerry Edwards Kucinich","Duffy, Brian, 1955-",,"University of Iowa. Libraries. Special Collections Dept.",2004-01-09|2011-04,,"Educational use only, no other permissions given. Copyright to this digital object is owned by The Des Moines Register; it may not be downloaded, reproduced, or distributed without written permission. For more information, contact the Special Collections Department.","Editorial Cartoons of Brian Duffy; Des Moines Register Cartoonists|Papers of Brian Duffy|Des Moines Register",,English,"Still image|Editorial cartoons",MSC916|duffy-040109|http://digital.lib.uiowa.edu/cdm/ref/collection/duffy/id/115,,,,,,,,,,,,,,,,,,,,,,,,,,,,,,,,,,,,,,,,,,,,,,,,"<a href=""http://digital.lib.uiowa.edu/cdm/ref/collection/duffy/id/115"" target=""_blank"">View this item in its source respository</a>",,,,,,,,,,,,,,,,,,,,,,,,,,,,,http://www.iowaheritage.org/files/original/48384d0e5d865d32e056037bae4f8f11.jpg,"Remote Item","Editorial Cartoons of Brian Duffy",1,0
6556,http://www.iowaheritage.org/items/show/6556,"We'll soon know whether we've elected an Alexander or not.","Government|Hoover, Herbert, 1874-1964|Washington, D.C.|Swords|politics|Presidency|Congress|ordinary citizen.",,"Darling, Jay N. (Jay Norwood), 1876-1962","The Editorial cartoons of J.N. ""Ding"" Darling [electronic resource] : The Cowles Collection, Drake University, 1912-1962",,1928/12/28|1928,,"Copyright is owned by the ""Ding"" Darling Wildlife Society; it is administered on behalf of the Society by The University of Iowa. While use within the classroom is encouraged without specific authorization, publishing this cartoon in any format requires written permission. See policy and permissions procedure at: http://www.lib.uiowa.edu/spec-coll/services/dingdarling_fees.html","Cowles Library, Drake University, 2507 University Ave., Des Moines, IA 50311-4505.",,,,"281228.jpg|http://ddr.lib.drake.edu/u?/ddarling,3644",,,,,,,,,,,,,,,,,,,,,,,,,,,,,,,,,,,,,,,,,,,,,,,,"<a href=""http://ddr.lib.drake.edu/u?/ddarling,3644"" target=""_blank"">View this item in its source respository</a>",,,,,,,,,,,,,,,,,,,,,,,,,,,,,http://www.iowaheritage.org/files/original/4e92ee83eaa5d9678e391a1e5b79026a.jpg,"Remote Item","Editorial Cartoons of J.N. ""Ding"" Darling, Drake University",1,0
