 




﻿"Item Id","Item URI","Dublin Core:Title","Dublin Core:Subject","Dublin Core:Description","Dublin Core:Creator","Dublin Core:Source","Dublin Core:Publisher","Dublin Core:Date","Dublin Core:Contributor","Dublin Core:Rights","Dublin Core:Relation","Dublin Core:Format","Dublin Core:Language","Dublin Core:Type","Dublin Core:Identifier","Dublin Core:Coverage","Item Type Metadata:Text","Item Type Metadata:Interviewer","Item Type Metadata:Interviewee","Item Type Metadata:Location","Item Type Metadata:Transcription","Item Type Metadata:Local URL","Item Type Metadata:Original Format","Item Type Metadata:Physical Dimensions","Item Type Metadata:Duration","Item Type Metadata:Compression","Item Type Metadata:Producer","Item Type Metadata:Director","Item Type Metadata:Bit Rate/Frequency","Item Type Metadata:Time Summary","Item Type Metadata:Email Body","Item Type Metadata:Subject Line","Item Type Metadata:From","Item Type Metadata:To","Item Type Metadata:CC","Item Type Metadata:BCC","Item Type Metadata:Number of Attachments","Item Type Metadata:Standards","Item Type Metadata:Objectives","Item Type Metadata:Materials","Item Type Metadata:Lesson Plan Text","Item Type Metadata:URL","Item Type Metadata:Event Type","Item Type Metadata:Participants","Item Type Metadata:Birth Date","Item Type Metadata:Birthplace","Item Type Metadata:Death Date","Item Type Metadata:Occupation","Item Type Metadata:Biographical Text","Item Type Metadata:Bibliography","Item Type Metadata:Digital Reproduction Information","Item Type Metadata:Repository","Item Type Metadata:Repository Collection","Item Type Metadata:Contact information.","Item Type Metadata:File Name","Item Type Metadata:Notes","Item Type Metadata:Digital item created","Item Type Metadata:Digital item modified","Item Type Metadata:Executive Orders","Item Type Metadata:Record Created","Item Type Metadata:Record Modified","Item Type Metadata:Transcription2","Item Type Metadata:Source URL","Omeka Legacy File:Additional Creator","Omeka Legacy File:Transcriber","Omeka Legacy File:Producer","Omeka Legacy File:Render Device","Omeka Legacy File:Render Details","Omeka Legacy File:Capture Date","Omeka Legacy File:Capture Device","Omeka Legacy File:Capture Details","Omeka Legacy File:Change History","Omeka Legacy File:Watermark","Omeka Legacy File:Encryption","Omeka Legacy File:Compression","Omeka Legacy File:Post Processing","Omeka Image File:Width","Omeka Image File:Height","Omeka Image File:Bit Depth","Omeka Image File:Channels","Omeka Image File:Exif String","Omeka Image File:Exif Array","Omeka Image File:IPTC String","Omeka Image File:IPTC Array","Omeka Video File:Bitrate","Omeka Video File:Duration","Omeka Video File:Sample Rate","Omeka Video File:Codec","Omeka Video File:Width","Omeka Video File:Height",tags,file,itemType,collection,public,featured
10092,http://www.iowaheritage.org/items/show/10092,"Chicken farming, Atarashiki Mura commune, Saitama-ken, Japan, 1965","Collective settlements|Japanese|Atarashiki Mura|Japan -- Saitama-ken|1960-1970|Collective farms|Chicken industry|Poultry houses",,"Plath, David W.",,"University of Iowa. Libraries. University Archives",1965,,"Educational use only, no other permissions given. U.S. and international copyright laws may protect this item. Commercial use or distribution of this digital object is not permitted without written permission of the University Archives at The University of Iowa Libraries.","Anthropology at Iowa Digital Collection|David Plath Japanese Fieldwork Collection|David Plath Papers",5|5,,"Still image|Color slides|jpeg",PLA-slide044.jpg|https://digital.lib.uiowa.edu/,,,,,,,,,,,,,,,,,,,,,,,,,,,,,,,,,,,,,,,,,,,,,,,,"<a href=""https://digital.lib.uiowa.edu/"" target=""_blank"">View this item in its source respository</a>",,,,,,,,,,,,,,,,,,,,,,,,,,,,,http://www.iowaheritage.org/files/original/7aaeac23b2609f995571be10d8d6967c.jpg,"Remote Item","African American Women in Iowa Collection",1,0
10093,http://www.iowaheritage.org/items/show/10093,"Chicken farming, Atarashiki Mura commune, Saitama-ken, Japan, 1965","Collective settlements|Japanese|Atarashiki Mura|Japan -- Saitama-ken|1960-1970|Collective farms|Chicken industry|Poultry houses",,"Plath, David W.",,"University of Iowa. Libraries. University Archives",1965,,"Educational use only, no other permissions given. U.S. and international copyright laws may protect this item. Commercial use or distribution of this digital object is not permitted without written permission of the University Archives at The University of Iowa Libraries.","Anthropology at Iowa Digital Collection|David Plath Japanese Fieldwork Collection|David Plath Papers",5|5,,"Still image|Color slides|jpeg",PLA-slide045.jpg|https://digital.lib.uiowa.edu/,,,,,,,,,,,,,,,,,,,,,,,,,,,,,,,,,,,,,,,,,,,,,,,,"<a href=""https://digital.lib.uiowa.edu/"" target=""_blank"">View this item in its source respository</a>",,,,,,,,,,,,,,,,,,,,,,,,,,,,,http://www.iowaheritage.org/files/original/f71c8fbcd473ff74581de98064cf43c2.jpg,"Remote Item","African American Women in Iowa Collection",1,0
10097,http://www.iowaheritage.org/items/show/10097,"Chicken farming, Atarashiki Mura commune, Saitama-ken, Japan, 1965","Collective settlements|Japanese|Atarashiki Mura|Japan -- Saitama-ken|1960-1970|Collective farms|Chicken industry|Poultry houses",,"Plath, David W.",,"University of Iowa. Libraries. University Archives",1965,,"Educational use only, no other permissions given. U.S. and international copyright laws may protect this item. Commercial use or distribution of this digital object is not permitted without written permission of the University Archives at The University of Iowa Libraries.","Anthropology at Iowa Digital Collection|David Plath Japanese Fieldwork Collection|David Plath Papers",5|5,,"Still image|Color slides|jpeg",PLA-slide049.jpg|https://digital.lib.uiowa.edu/,,,,,,,,,,,,,,,,,,,,,,,,,,,,,,,,,,,,,,,,,,,,,,,,"<a href=""https://digital.lib.uiowa.edu/"" target=""_blank"">View this item in its source respository</a>",,,,,,,,,,,,,,,,,,,,,,,,,,,,,http://www.iowaheritage.org/files/original/d5101a788b7fab4c99e0ac0d63ce50af.jpg,"Remote Item","African American Women in Iowa Collection",1,0
10009,http://www.iowaheritage.org/items/show/10009,"Lunchtime, Atarashiki Mura commune, Saitama-ken, Japan, 1965","People|Japanese|Atarashiki Mura|Japan -- Hyuga|1960-1970|Men|Collective settlements|Collective farms|Chicken industry|Eggs",,"Plath, David W.",,"University of Iowa. Libraries. University Archives",1965|2008-03-03,,"Educational use only, no other permissions given. U.S. and international copyright laws may protect this item. Commercial use or distribution of this digital object is not permitted without written permission of the University Archives at The University of Iowa Libraries.","Anthropology at Iowa Digital Collection|David Plath Japanese Fieldwork Collection|David Plath Papers|In process",,,"Still image|Photographs|jpeg",AM09.jpg|https://digital.lib.uiowa.edu/,,,,,,,,,,,,,,,,,,,,,,,,,,,,,,,,,,,,,,,,,,,,,,,,"<a href=""https://digital.lib.uiowa.edu/"" target=""_blank"">View this item in its source respository</a>",,,,,,,,,,,,,,,,,,,,,,,,,,,,,http://www.iowaheritage.org/files/original/da7f94b3af41e1dc0537cba71d3aaa9d.jpg,"Remote Item","African American Women in Iowa Collection",1,0
10006,http://www.iowaheritage.org/items/show/10006,"Packing eggs for sale, Atarashiki Mura commune, Saitama-ken, Japan, 1965","Men|Japanese|Atarashiki Mura|Japan -- Hyuga|1960-1970|People|Collective settlements|Collective farms|Chicken industry|Eggs",,"Plath, David W.",,"University of Iowa. Libraries. University Archives",1965|2008-03-03,,"Educational use only, no other permissions given. U.S. and international copyright laws may protect this item. Commercial use or distribution of this digital object is not permitted without written permission of the University Archives at The University of Iowa Libraries.","Anthropology at Iowa Digital Collection|David Plath Japanese Fieldwork Collection|David Plath Papers|In process",,,"Still image|Photographs|jpeg",AM06.jpg|https://digital.lib.uiowa.edu/,,,,,,,,,,,,,,,,,,,,,,,,,,,,,,,,,,,,,,,,,,,,,,,,"<a href=""https://digital.lib.uiowa.edu/"" target=""_blank"">View this item in its source respository</a>",,,,,,,,,,,,,,,,,,,,,,,,,,,,,http://www.iowaheritage.org/files/original/81310c2b9b39e01665190665be4a293a.jpg,"Remote Item","African American Women in Iowa Collection",1,0
10094,http://www.iowaheritage.org/items/show/10094,"Packing eggs for sale, Atarashiki Mura commune, Saitama-ken, Japan, 1965","Collective settlements|Japanese|Atarashiki Mura|Japan -- Saitama-ken|1960-1970|Collective farms|People|Men|Eggs|Chicken industry",,"Plath, David W.",,"University of Iowa. Libraries. University Archives",1965,,"Educational use only, no other permissions given. U.S. and international copyright laws may protect this item. Commercial use or distribution of this digital object is not permitted without written permission of the University Archives at The University of Iowa Libraries.","Anthropology at Iowa Digital Collection|David Plath Japanese Fieldwork Collection|David Plath Papers",5|5,,"Still image|Color slides|jpeg",PLA-slide046.jpg|https://digital.lib.uiowa.edu/,,,,,,,,,,,,,,,,,,,,,,,,,,,,,,,,,,,,,,,,,,,,,,,,"<a href=""https://digital.lib.uiowa.edu/"" target=""_blank"">View this item in its source respository</a>",,,,,,,,,,,,,,,,,,,,,,,,,,,,,http://www.iowaheritage.org/files/original/e0488d86a8eb8bc88e9ffba7cffd492e.jpg,"Remote Item","African American Women in Iowa Collection",1,0
10095,http://www.iowaheritage.org/items/show/10095,"Packing eggs for sale, Atarashiki Mura commune, Saitama-ken, Japan, 1965","Collective settlements|Japanese|Atarashiki Mura|Japan -- Saitama-ken|1960-1970|Collective farms|People|Men|Eggs|Chicken industry",,"Plath, David W.",,"University of Iowa. Libraries. University Archives",1965,,"Educational use only, no other permissions given. U.S. and international copyright laws may protect this item. Commercial use or distribution of this digital object is not permitted without written permission of the University Archives at The University of Iowa Libraries.","Anthropology at Iowa Digital Collection|David Plath Japanese Fieldwork Collection|David Plath Papers",5|5,,"Still image|Color slides|jpeg",PLA-slide047.jpg|https://digital.lib.uiowa.edu/,,,,,,,,,,,,,,,,,,,,,,,,,,,,,,,,,,,,,,,,,,,,,,,,"<a href=""https://digital.lib.uiowa.edu/"" target=""_blank"">View this item in its source respository</a>",,,,,,,,,,,,,,,,,,,,,,,,,,,,,http://www.iowaheritage.org/files/original/671e86a004c88a4ef3095f9a801e1633.jpg,"Remote Item","African American Women in Iowa Collection",1,0
10054,http://www.iowaheritage.org/items/show/10054,"Sorting eggs for sales, Yamagishi Kai, Mie-ken, Japan, 1965","Collective settlements|Japanese|Yamagishi Kai|Japan -- Mie-ken|1960-1970|Collective farms|Chicken industry|Eggs|People",,"Plath, David W.",,"University of Iowa. Libraries. University Archives",1965,,"Educational use only, no other permissions given. U.S. and international copyright laws may protect this item. Commercial use or distribution of this digital object is not permitted without written permission of the University Archives at The University of Iowa Libraries.","Anthropology at Iowa Digital Collection|David Plath Japanese Fieldwork Collection|David Plath Papers",5|5,,"Still image|Color slides|jpeg",https://digital.lib.uiowa.edu/,,,,,,,,,,,,,,,,,,,,,,,,,,,,,,,,,,,,,,,,,,,,,,,,"<a href=""https://digital.lib.uiowa.edu/"" target=""_blank"">View this item in its source respository</a>",,,,,,,,,,,,,,,,,,,,,,,,,,,,,http://www.iowaheritage.org/files/original/c5236bb12d6cebe1bc4248dc7289a2fa.jpg,"Remote Item","African American Women in Iowa Collection",1,0
