 




﻿"Item Id","Item URI","Dublin Core:Title","Dublin Core:Subject","Dublin Core:Description","Dublin Core:Creator","Dublin Core:Source","Dublin Core:Publisher","Dublin Core:Date","Dublin Core:Contributor","Dublin Core:Rights","Dublin Core:Relation","Dublin Core:Format","Dublin Core:Language","Dublin Core:Type","Dublin Core:Identifier","Dublin Core:Coverage","Item Type Metadata:Text","Item Type Metadata:Interviewer","Item Type Metadata:Interviewee","Item Type Metadata:Location","Item Type Metadata:Transcription","Item Type Metadata:Local URL","Item Type Metadata:Original Format","Item Type Metadata:Physical Dimensions","Item Type Metadata:Duration","Item Type Metadata:Compression","Item Type Metadata:Producer","Item Type Metadata:Director","Item Type Metadata:Bit Rate/Frequency","Item Type Metadata:Time Summary","Item Type Metadata:Email Body","Item Type Metadata:Subject Line","Item Type Metadata:From","Item Type Metadata:To","Item Type Metadata:CC","Item Type Metadata:BCC","Item Type Metadata:Number of Attachments","Item Type Metadata:Standards","Item Type Metadata:Objectives","Item Type Metadata:Materials","Item Type Metadata:Lesson Plan Text","Item Type Metadata:URL","Item Type Metadata:Event Type","Item Type Metadata:Participants","Item Type Metadata:Birth Date","Item Type Metadata:Birthplace","Item Type Metadata:Death Date","Item Type Metadata:Occupation","Item Type Metadata:Biographical Text","Item Type Metadata:Bibliography","Item Type Metadata:Digital Reproduction Information","Item Type Metadata:Repository","Item Type Metadata:Repository Collection","Item Type Metadata:Contact information.","Item Type Metadata:File Name","Item Type Metadata:Notes","Item Type Metadata:Digital item created","Item Type Metadata:Digital item modified","Item Type Metadata:Executive Orders","Item Type Metadata:Record Created","Item Type Metadata:Record Modified","Item Type Metadata:Transcription2","Item Type Metadata:Source URL","Omeka Legacy File:Additional Creator","Omeka Legacy File:Transcriber","Omeka Legacy File:Producer","Omeka Legacy File:Render Device","Omeka Legacy File:Render Details","Omeka Legacy File:Capture Date","Omeka Legacy File:Capture Device","Omeka Legacy File:Capture Details","Omeka Legacy File:Change History","Omeka Legacy File:Watermark","Omeka Legacy File:Encryption","Omeka Legacy File:Compression","Omeka Legacy File:Post Processing","Omeka Image File:Width","Omeka Image File:Height","Omeka Image File:Bit Depth","Omeka Image File:Channels","Omeka Image File:Exif String","Omeka Image File:Exif Array","Omeka Image File:IPTC String","Omeka Image File:IPTC Array","Omeka Video File:Bitrate","Omeka Video File:Duration","Omeka Video File:Sample Rate","Omeka Video File:Codec","Omeka Video File:Width","Omeka Video File:Height",tags,file,itemType,collection,public,featured
9932,http://www.iowaheritage.org/items/show/9932,"""Miss Letta Cary to wed,"" March 16, 1917","Alumni & alumnae|African Americans|Bledsoe, Letta Cary|University of Iowa|1910-1920",,unknown,,"Bystander (Des Moines, Iowa)|State Historical Society of Iowa (Des Moines)",1917-03-16|2008-01-09,,"Educational use only, no other permissions given. U.S. and international copyright laws may protect this digital image. Commercial use or distribution of the image is not permitted without prior permission of the copyright holder.","African American Women in Iowa Digital Collection; African American Women Students at the University of Iowa, 1910-1960|http://digital.lib.uiowa.edu/aaws/",jpeg,,"Text|Clippings (Information artifacts); Microfilms",bystander072.jpg|166295411|https://digital.lib.uiowa.edu/,,,,,,,,,,,,,,,,,,,,,,,,,,,,,,,,,,,,,,,,,,,,,,,,"<a href=""https://digital.lib.uiowa.edu/"" target=""_blank"">View this item in its source respository</a>",,,,,,,,,,,,,,,,,,,,,,,,,,,,,http://www.iowaheritage.org/files/original/fc643fa15e8dcb47fab8fad9f451e0d7.jpg,"Remote Item","African American Women in Iowa Collection",1,0
9794,http://www.iowaheritage.org/items/show/9794,"""Negro girl crowned as Miss S.U.I.,"" 1955","Beauty contests|African Americans|Berry, Dora Martin|1950-1960|Race relations|Students",,"Kapenstein, Ira",,"Des Moines Register and Tribune Company|University of Iowa. Libraries. University Archives",1955|2007-10-04,,"Educational use only, no other permissions given. U.S. and international copyright laws may protect this digital object. Commercial use or distribution of the object is not permitted without prior permission of the copyright holder.","African American Women in Iowa Digital Collection; African American Women Students at the University of Iowa, 1910-1960|http://digital.lib.uiowa.edu/aaws/|Alumni and Former Students Vertical Files|http://lib.uiowa.edu/collguides/?RG01.0015.01|Martin, Dora",jpeg,,"Text; Still image|Clippings (Information artifacts)",RG01.15.01|MartinBerry009|166295411|https://digital.lib.uiowa.edu/,,,,,,,,,,,,,,,,,,,,,,,,,,,,,,,,,,,,,,,,,,,,,,,,"<a href=""https://digital.lib.uiowa.edu/"" target=""_blank"">View this item in its source respository</a>",,,,,,,,,,,,,,,,,,,,,,,,,,,,,http://www.iowaheritage.org/files/original/8e38e9dc9d5261255ef74bbe8b2f723f.jpg,"Remote Item","African American Women in Iowa Collection",1,0
9802,http://www.iowaheritage.org/items/show/9802,"""Negro woman receives Ph.D. at summer convocation,"" September, 1941","Graduate students|African Americans|Johnson, Lulu Merle|United States -- Iowa -- Iowa City|1940-1950",,unknown,,"University of Iowa|University of Iowa. Libraries. University Archives",1941-09|2007-10-02,,"Educational use only, no other permissions given. U.S. and international copyright laws may protect this digital object. Commercial use or distribution of the object is not permitted without prior permission of the copyright holder.","African American Women in Iowa Digital Collection; African American Women Students at the University of Iowa, 1910-1960|http://digital.lib.uiowa.edu/aaws/|Alumni and Former Students Vertical Files|http://lib.uiowa.edu/collguides/?RG01.0015.01|Johnson, Lulu Merle",jpeg,,"Text|Clippings (Information artifacts)",RG01.15.01|JohnsonLM002.jpg|166295411|https://digital.lib.uiowa.edu/,,,,,,,,,,,,,,,,,,,,,,,,,,,,,,,,,,,,,,,,,,,,,,,,"<a href=""https://digital.lib.uiowa.edu/"" target=""_blank"">View this item in its source respository</a>",,,,,,,,,,,,,,,,,,,,,,,,,,,,,http://www.iowaheritage.org/files/original/d39b6e7da2e6494d27a6e17a31a4c6e0.jpg,"Remote Item","African American Women in Iowa Collection",1,0
9874,http://www.iowaheritage.org/items/show/9874,"""Noble negro women of Iowa,"" September 19, 1919","Housing|African Americans|Downey, Helen|Iowa Federation of Colored Women's Clubs|United States -- Iowa -- Iowa City|1910-1920|Fund raising|Students|Clubs",,unknown,,"Bystander (Des Moines, Iowa)|State Historical Society of Iowa (Des Moines)",1919-09-19|2008-01-07,,"Educational use only, no other permissions given. U.S. and international copyright laws may protect this digital image. Commercial use or distribution of the image is not permitted without prior permission of the copyright holder.","African American Women in Iowa Digital Collection; African American Women Students at the University of Iowa, 1910-1960|http://digital.lib.uiowa.edu/aaws/",jpeg,,"Text|Clippings (Information artifacts); Microfilms",bystander013.jpg|166295411|https://digital.lib.uiowa.edu/,,,,,,,,,,,,,,,,,,,,,,,,,,,,,,,,,,,,,,,,,,,,,,,,"<a href=""https://digital.lib.uiowa.edu/"" target=""_blank"">View this item in its source respository</a>",,,,,,,,,,,,,,,,,,,,,,,,,,,,,http://www.iowaheritage.org/files/original/6e390d8d2696af6f9f83216ee3fccfe8.jpg,"Remote Item","African American Women in Iowa Collection",1,0
9906,http://www.iowaheritage.org/items/show/9906,"""Our neighbors, Iowa City items: The commencement exercises of the State University of Iowa were held,"" July 7, 1921","Students|African Americans|Crutcher, Golda|University of Iowa|United States -- Iowa -- Iowa City|1920-1930|Graduation ceremonies|Searcy, Etta|Suggs, Lorena",,unknown,,"Bystander (Des Moines, Iowa)|State Historical Society of Iowa (Des Moines)",1921-07-07|2008-01-08,,"Educational use only, no other permissions given. U.S. and international copyright laws may protect this digital image. Commercial use or distribution of the image is not permitted without prior permission of the copyright holder.","African American Women in Iowa Digital Collection; African American Women Students at the University of Iowa, 1910-1960|http://digital.lib.uiowa.edu/aaws/",jpeg,,"Text|Clippings (Information artifacts); Microfilms",bystander043.jpg|166295411|https://digital.lib.uiowa.edu/,,,,,,,,,,,,,,,,,,,,,,,,,,,,,,,,,,,,,,,,,,,,,,,,"<a href=""https://digital.lib.uiowa.edu/"" target=""_blank"">View this item in its source respository</a>",,,,,,,,,,,,,,,,,,,,,,,,,,,,,http://www.iowaheritage.org/files/original/bec877ed7295b158ef604e072529d42f.jpg,"Remote Item","African American Women in Iowa Collection",1,0
9893,http://www.iowaheritage.org/items/show/9893,"""People of the trustee board of Iowa federation home,"" September 2, 1920","Housing|African Americans|Downey, Helen|Iowa Federation of Colored Women's Clubs|United States -- Iowa -- Iowa City|1920-1930|Fund raising|Students|Clubs|Dormitories",,unknown,,"Bystander (Des Moines, Iowa)|State Historical Society of Iowa (Des Moines)",1920-09-02|2008-01-07,,"Educational use only, no other permissions given. U.S. and international copyright laws may protect this digital image. Commercial use or distribution of the image is not permitted without prior permission of the copyright holder.","African American Women in Iowa Digital Collection; African American Women Students at the University of Iowa, 1910-1960|http://digital.lib.uiowa.edu/aaws/",jpeg,,"Text|Clippings (Information artifacts); Microfilms",bystander035.jpg|166295411|https://digital.lib.uiowa.edu/,,,,,,,,,,,,,,,,,,,,,,,,,,,,,,,,,,,,,,,,,,,,,,,,"<a href=""https://digital.lib.uiowa.edu/"" target=""_blank"">View this item in its source respository</a>",,,,,,,,,,,,,,,,,,,,,,,,,,,,,http://www.iowaheritage.org/files/original/ab273998995d8bbb2cd848cbe3024e02.jpg,"Remote Item","African American Women in Iowa Collection",1,0
9858,http://www.iowaheritage.org/items/show/9858,"""Presenting Dora Lee, queen of the campus,"" February 9, 1956","Beauty contests|African Americans|Berry, Dora Martin|1950-1960|Race relations|Students|Lucy, Autherine, 1930-","These articles contrast the experiences of two African American college students, Dora Martin and Autherine Lucy.",unknown,,"Daily Mail (London, England)|University of Iowa. Libraries. University Archives",1956-02-09|2008-01-15,,"Educational use only, no other permissions given. U.S. and international copyright laws may protect this digital object. Commercial use or distribution of the object is not permitted without prior permission of the copyright holder.","African American Women in Iowa Digital Collection; African American Women Students at the University of Iowa, 1910-1960|http://digital.lib.uiowa.edu/aaws/|Alumni and Former Students Vertical Files|http://lib.uiowa.edu/collguides/?RG01.0015.01|Martin, Dora",jpeg,,"Text; Still image|Clippings (Information artifacts)",RG01.15.01|166295411|https://digital.lib.uiowa.edu/,,,,,,,,,,,,,,,,,,,,,,,,,,,,,,,,,,,,,,,,,,,,,,,,"<a href=""https://digital.lib.uiowa.edu/"" target=""_blank"">View this item in its source respository</a>",,,,,,,,,,,,,,,,,,,,,,,,,,,,,http://www.iowaheritage.org/files/original/d76c003e4c05a5e9169e4edfb108f32a.jpg,"Remote Item","African American Women in Iowa Collection",1,0
9823,http://www.iowaheritage.org/items/show/9823,"""Queen and two attendants chosen at the Kappa Alpha Psi dance,"" May 9, 1948","Students|African Americans|Morris, Arlene Roberts|1940-1950|Parties|Bailey, Roberta Jean|Smith, Yvonne",,unknown,,"Daily Iowan (Iowa City, Iowa)|University of Iowa. Libraries. University Archives",1948-05-09|2007-10-03,,"Educational use only, no other permissions given. U.S. and international copyright laws may protect this digital object. Commercial use or distribution of the object is not permitted without prior permission of the copyright holder.","African American Women in Iowa Digital Collection; African American Women Students at the University of Iowa, 1910-1960|http://digital.lib.uiowa.edu/aaws/|Organizations and Clubs Vertical Files|http://lib.uiowa.edu/collguides/?RG01.0015.04|Kappa Alpha Psi",jpeg,,"Still image; Text|Clippings (Information artifacts)",RG01.15.04|RobertsMorris001.jpg|166295411|https://digital.lib.uiowa.edu/,,,,,,,,,,,,,,,,,,,,,,,,,,,,,,,,,,,,,,,,,,,,,,,,"<a href=""https://digital.lib.uiowa.edu/"" target=""_blank"">View this item in its source respository</a>",,,,,,,,,,,,,,,,,,,,,,,,,,,,,http://www.iowaheritage.org/files/original/df52dd6fcc6dbde924f5f90b3710de6f.jpg,"Remote Item","African American Women in Iowa Collection",1,0
9808,http://www.iowaheritage.org/items/show/9808,"""Queen of the campus,"" December 12, 1955","Beauty contests|African Americans|Berry, Dora Martin|1950-1960|Students",,unknown,,"Star (London, England)|University of Iowa. Libraries. University Archives",1955-12-12|2007-10-02,,"Educational use only, no other permissions given. U.S. and international copyright laws may protect this digital object. Commercial use or distribution of the object is not permitted without prior permission of the copyright holder.","African American Women in Iowa Digital Collection; African American Women Students at the University of Iowa, 1910-1960|http://digital.lib.uiowa.edu/aaws/|Alumni and Former Students Vertical Files|http://lib.uiowa.edu/collguides/?RG01.0015.01|Martin, Dora",jpeg,,"Text; Still image|Clippings (Information artifacts)",RG01.15.01|MartinBerry011.jpg|166295411|https://digital.lib.uiowa.edu/,,,,,,,,,,,,,,,,,,,,,,,,,,,,,,,,,,,,,,,,,,,,,,,,"<a href=""https://digital.lib.uiowa.edu/"" target=""_blank"">View this item in its source respository</a>",,,,,,,,,,,,,,,,,,,,,,,,,,,,,http://www.iowaheritage.org/files/original/a8509e2ab811cb58a1930d907d1b25a8.jpg,"Remote Item","African American Women in Iowa Collection",1,0
9824,http://www.iowaheritage.org/items/show/9824,"""Queen of the campus,"" February 4, 1956","Beauty contests|African Americans|Berry, Dora Martin|1950-1960|Students",,"Dmitri, Ivan",,"Saturday evening post|University of Iowa. Libraries. University Archives",1956-02-04|2007-10-04,,"Educational use only, no other permissions given. U.S. and international copyright laws may protect this digital object. Commercial use or distribution of the object is not permitted without prior permission of the copyright holder.","African American Women in Iowa Digital Collection; African American Women Students at the University of Iowa, 1910-1960|http://digital.lib.uiowa.edu/aaws/|Alumni and Former Students Vertical Files|http://lib.uiowa.edu/collguides/?RG01.0015.01|Martin, Dora",jpeg,,"Still image; Text|Clippings (Information artifacts)",RG01.15.01|166295411|https://digital.lib.uiowa.edu/,,,,,,,,,,,,,,,,,,,,,,,,,,,,,,,,,,,,,,,,,,,,,,,,"<a href=""https://digital.lib.uiowa.edu/"" target=""_blank"">View this item in its source respository</a>",,,,,,,,,,,,,,,,,,,,,,,,,,,,,http://www.iowaheritage.org/files/original/aec57d17c9479288adfec2f54a2d7024.jpg,"Remote Item","African American Women in Iowa Collection",1,0
