 




﻿"Item Id","Item URI","Dublin Core:Title","Dublin Core:Subject","Dublin Core:Description","Dublin Core:Creator","Dublin Core:Source","Dublin Core:Publisher","Dublin Core:Date","Dublin Core:Contributor","Dublin Core:Rights","Dublin Core:Relation","Dublin Core:Format","Dublin Core:Language","Dublin Core:Type","Dublin Core:Identifier","Dublin Core:Coverage","Item Type Metadata:Text","Item Type Metadata:Interviewer","Item Type Metadata:Interviewee","Item Type Metadata:Location","Item Type Metadata:Transcription","Item Type Metadata:Local URL","Item Type Metadata:Original Format","Item Type Metadata:Physical Dimensions","Item Type Metadata:Duration","Item Type Metadata:Compression","Item Type Metadata:Producer","Item Type Metadata:Director","Item Type Metadata:Bit Rate/Frequency","Item Type Metadata:Time Summary","Item Type Metadata:Email Body","Item Type Metadata:Subject Line","Item Type Metadata:From","Item Type Metadata:To","Item Type Metadata:CC","Item Type Metadata:BCC","Item Type Metadata:Number of Attachments","Item Type Metadata:Standards","Item Type Metadata:Objectives","Item Type Metadata:Materials","Item Type Metadata:Lesson Plan Text","Item Type Metadata:URL","Item Type Metadata:Event Type","Item Type Metadata:Participants","Item Type Metadata:Birth Date","Item Type Metadata:Birthplace","Item Type Metadata:Death Date","Item Type Metadata:Occupation","Item Type Metadata:Biographical Text","Item Type Metadata:Bibliography","Item Type Metadata:Digital Reproduction Information","Item Type Metadata:Repository","Item Type Metadata:Repository Collection","Item Type Metadata:Contact information.","Item Type Metadata:File Name","Item Type Metadata:Notes","Item Type Metadata:Digital item created","Item Type Metadata:Digital item modified","Item Type Metadata:Executive Orders","Item Type Metadata:Record Created","Item Type Metadata:Record Modified","Item Type Metadata:Transcription2","Item Type Metadata:Source URL","Omeka Legacy File:Additional Creator","Omeka Legacy File:Transcriber","Omeka Legacy File:Producer","Omeka Legacy File:Render Device","Omeka Legacy File:Render Details","Omeka Legacy File:Capture Date","Omeka Legacy File:Capture Device","Omeka Legacy File:Capture Details","Omeka Legacy File:Change History","Omeka Legacy File:Watermark","Omeka Legacy File:Encryption","Omeka Legacy File:Compression","Omeka Legacy File:Post Processing","Omeka Image File:Width","Omeka Image File:Height","Omeka Image File:Bit Depth","Omeka Image File:Channels","Omeka Image File:Exif String","Omeka Image File:Exif Array","Omeka Image File:IPTC String","Omeka Image File:IPTC Array","Omeka Video File:Bitrate","Omeka Video File:Duration","Omeka Video File:Sample Rate","Omeka Video File:Codec","Omeka Video File:Width","Omeka Video File:Height",tags,file,itemType,collection,public,featured
35752,http://www.iowaheritage.org/items/show/35752,"Louise Noun with Annie Savery portrait at the Iowa Historical Building, Des Moines, Iowa, August 26, 1972","Women|Noun, Louise R.|Iowa. State Historical Dept.|United States -- Iowa -- Des Moines|1970-1980|Activists|Paintings|Art collectors","Louise Noun paid for the restoration of this painting",unknown,,"University of Iowa. Libraries. Iowa Women's Archives",1972|2007-09-13,,"Educational use only, no other permissions given. U.S. and international copyright laws may protect this item. Commercial use or distribution of this digital object is not permitted without written permission of the Iowa Women's Archives.","Iowa Women's Archives Founders|Louise Rosenfield Noun Papers, 1926-2002|http://www.lib.uiowa.edu/collguides/?IWA0035|Assorted photographs of Louse Noun, 1950-2000",jpeg,,"Still image|Photographs",IWA0035|index.cpd|https://digital.lib.uiowa.edu/,,,,,,,,,,,,,,,,,,,,,,,,,,,,,,,,,,,,,,,,,,,,,,,,"<a href=""https://digital.lib.uiowa.edu/"" target=""_blank"">View this item in its source respository</a>",,,,,,,,,,,,,,,,,,,,,,,,,,,,,http://www.iowaheritage.org/files/original/c3b843d61f3bad1fdf8d99e432b2ba58.jpg,"Remote Item","Iowa Women's Archives Founders",1,1
17550,http://www.iowaheritage.org/items/show/17550,"Louise Noun with Catherine Rymph and Charles Hawley at the Uses of Suffrage Conference, University of Iowa, Iowa City, Iowa, September 1996","Women|Noun, Louise R.|University of Iowa|United States -- Iowa -- Iowa City|1990-2000|Activists|Art collectors|Authors|Teachers|Men|Rymph, Catherine E.|Hawley, Charles Valencia",,unknown,,"University of Iowa. Libraries. Iowa Women's Archives",1996-09|2007-09-13,,"Educational use only, no other permissions given. U.S. and international copyright laws may protect this item. Commercial use or distribution of this digital object is not permitted without written permission of the Iowa Women's Archives.","Iowa Women's Archives Founders|Louise Rosenfield Noun Papers, 1926-2002|http://www.lib.uiowa.edu/collguides/?IWA0035|Uses of Suffrage, 1996",jpeg,,"Still image|Photographs",IWA0035|https://digital.lib.uiowa.edu/,,,,,,,,,,,,,,,,,,,,,,,,,,,,,,,,,,,,,,,,,,,,,,,,"<a href=""https://digital.lib.uiowa.edu/"" target=""_blank"">View this item in its source respository</a>",,,,,,,,,,,,,,,,,,,,,,,,,,,,,http://www.iowaheritage.org/files/original/4b44140fbbeca116842f64f16e8c4d89.jpg,"Remote Item","Iowa Women's Archives Founders",1,0
17368,http://www.iowaheritage.org/items/show/17368,"Louise Noun with family, Iowa, mid-1920s","Women|Noun, Louise R.|United States -- Iowa|1920-1930|Activists|Authors|Art collectors|Children|Families|Rosenfield family",,unknown,,"University of Iowa. Libraries. Iowa Women's Archives",1920/1929|2007-09-13,,"Educational use only, no other permissions given. U.S. and international copyright laws may protect this item. Commercial use or distribution of this digital object is not permitted without written permission of the Iowa Women's Archives.","Iowa Women's Archives Founders|Louise Rosenfield Noun Papers, 1926-2002|http://www.lib.uiowa.edu/collguides/?IWA0035",jpeg,,"Still image|Photographs",IWA0035|https://digital.lib.uiowa.edu/,,,,,,,,,,,,,,,,,,,,,,,,,,,,,,,,,,,,,,,,,,,,,,,,"<a href=""https://digital.lib.uiowa.edu/"" target=""_blank"">View this item in its source respository</a>",,,,,,,,,,,,,,,,,,,,,,,,,,,,,http://www.iowaheritage.org/files/original/5a49c20137e6f50d997688a67ec71b79.jpg,"Remote Item","Iowa Women's Archives Founders",1,0
17431,http://www.iowaheritage.org/items/show/17431,"Louise Noun with Japanese family, Japan, October 1973","Women|Japanese|Noun, Louise R.|Japan|1970-1980|Activists|Authors|Art collectors|Men|Children|Families",,unknown,,"University of Iowa. Libraries. Iowa Women's Archives",1973-10|2007-09-13,,"Educational use only, no other permissions given. U.S. and international copyright laws may protect this item. Commercial use or distribution of this digital object is not permitted without written permission of the Iowa Women's Archives.","Iowa Women's Archives Founders|Louise Rosenfield Noun Papers, 1926-2002|http://www.lib.uiowa.edu/collguides/?IWA0035|LN with other people, 1991-2000",jpeg,,"Still image|Photographs",IWA0035|https://digital.lib.uiowa.edu/,,,,,,,,,,,,,,,,,,,,,,,,,,,,,,,,,,,,,,,,,,,,,,,,"<a href=""https://digital.lib.uiowa.edu/"" target=""_blank"">View this item in its source respository</a>",,,,,,,,,,,,,,,,,,,,,,,,,,,,,http://www.iowaheritage.org/files/original/63e927449c171523be4d297c746f941e.jpg,"Remote Item","Iowa Women's Archives Founders",1,0
17372,http://www.iowaheritage.org/items/show/17372,"Louise Noun with siblings Joe and Ruth Rosenfield, Iowa, early 1920s","Women|Noun, Louise R.|United States -- Iowa|1920-1930|Activists|Authors|Art collectors|Children|Families|Rosenfield, Joseph|Rosenfield, Ruth",,unknown,,"University of Iowa. Libraries. Iowa Women's Archives",1920/1929|2007-09-13,,"Educational use only, no other permissions given. U.S. and international copyright laws may protect this item. Commercial use or distribution of this digital object is not permitted without written permission of the Iowa Women's Archives.","Iowa Women's Archives Founders|Louise Rosenfield Noun Papers, 1926-2002|http://www.lib.uiowa.edu/collguides/?IWA0035",jpeg,,"Still image|Photographs",IWA0035|https://digital.lib.uiowa.edu/,,,,,,,,,,,,,,,,,,,,,,,,,,,,,,,,,,,,,,,,,,,,,,,,"<a href=""https://digital.lib.uiowa.edu/"" target=""_blank"">View this item in its source respository</a>",,,,,,,,,,,,,,,,,,,,,,,,,,,,,http://www.iowaheritage.org/files/original/86e8e2709a65ae7c47de76dc1e7cf8d2.jpg,"Remote Item","Iowa Women's Archives Founders",1,0
17453,http://www.iowaheritage.org/items/show/17453,"Louise Noun with Susan and Bill Knapp and family on Thanksgiving, Iowa, November 2000","Women|Thanksgiving Day|Noun, Louise R.|United States -- Iowa|1990-2000|Activists|Authors|Art collectors|Men|Children|Families|Knapp, Bill|Knapp, Susan",,unknown,,"University of Iowa. Libraries. Iowa Women's Archives",2000-11|2007-09-13,,"Educational use only, no other permissions given. U.S. and international copyright laws may protect this item. Commercial use or distribution of this digital object is not permitted without written permission of the Iowa Women's Archives.","Iowa Women's Archives Founders|Louise Rosenfield Noun Papers, 1926-2002|http://www.lib.uiowa.edu/collguides/?IWA0035|LN with other people, 1991-2000",jpeg,,"Still image|Photographs",IWA0035|https://digital.lib.uiowa.edu/,,,,,,,,,,,,,,,,,,,,,,,,,,,,,,,,,,,,,,,,,,,,,,,,"<a href=""https://digital.lib.uiowa.edu/"" target=""_blank"">View this item in its source respository</a>",,,,,,,,,,,,,,,,,,,,,,,,,,,,,http://www.iowaheritage.org/files/original/21246364f5767763ef787cfb4144e6af.jpg,"Remote Item","Iowa Women's Archives Founders",1,0
17454,http://www.iowaheritage.org/items/show/17454,"Louise Noun with Susan and Bill Knapp at Thanksgiving, Iowa, November 2000","Women|Thanksgiving Day|Noun, Louise R.|United States -- Iowa|1990-2000|Activists|Authors|Art collectors|Men|Business people|Knapp, Bill|Knapp, Susan",,unknown,,"University of Iowa. Libraries. Iowa Women's Archives",2000-11|2007-09-13,,"Educational use only, no other permissions given. U.S. and international copyright laws may protect this item. Commercial use or distribution of this digital object is not permitted without written permission of the Iowa Women's Archives.","Iowa Women's Archives Founders|Louise Rosenfield Noun Papers, 1926-2002|http://www.lib.uiowa.edu/collguides/?IWA0035|LN with other people, 1991-2000",jpeg,,"Still image|Photographs",IWA0035|https://digital.lib.uiowa.edu/,,,,,,,,,,,,,,,,,,,,,,,,,,,,,,,,,,,,,,,,,,,,,,,,"<a href=""https://digital.lib.uiowa.edu/"" target=""_blank"">View this item in its source respository</a>",,,,,,,,,,,,,,,,,,,,,,,,,,,,,http://www.iowaheritage.org/files/original/6ada38399d25c35ed96029ef7a31ec50.jpg,"Remote Item","Iowa Women's Archives Founders",1,0
17544,http://www.iowaheritage.org/items/show/17544,"Louise Noun, Billie Ray and Joanne Fine unveiling the sign at the opening of Young Women's Resource Center, Des Moines, Iowa, January 1978","Women|Noun, Louise R.|Young Women's Resource Center (Des Moines, Iowa)|United States -- Iowa -- Des Moines|1970-1980|Activists|Art collectors|Authors|Legislators' spouses|Ray, Billie|Fine, Joanne","""Joanne Fine, director - Louise Noun, president.""",unknown,,"University of Iowa. Libraries. Iowa Women's Archives",1978-01|2007-09-13,,"Educational use only, no other permissions given. U.S. and international copyright laws may protect this item. Commercial use or distribution of this digital object is not permitted without written permission of the Iowa Women's Archives.","Iowa Women's Archives Founders|Louise Rosenfield Noun Papers, 1926-2002|http://www.lib.uiowa.edu/collguides/?IWA0035|Young Women's Resource Center, 1978, 1983",jpeg,,"Still image|Photographs",IWA0035|https://digital.lib.uiowa.edu/,,,,,,,,,,,,,,,,,,,,,,,,,,,,,,,,,,,,,,,,,,,,,,,,"<a href=""https://digital.lib.uiowa.edu/"" target=""_blank"">View this item in its source respository</a>",,,,,,,,,,,,,,,,,,,,,,,,,,,,,http://www.iowaheritage.org/files/original/7f4b0187dfd27693367534bb78dc5b68.jpg,"Remote Item","Iowa Women's Archives Founders",1,0
17438,http://www.iowaheritage.org/items/show/17438,"Louise Noun, college age, ca. 1928","Women|Noun, Louise R.|1920-1930|Activists|Art collectors|Authors",,unknown,,"University of Iowa. Libraries. Iowa Women's Archives",1928|2007-09-13,,"Educational use only, no other permissions given. U.S. and international copyright laws may protect this item. Commercial use or distribution of this digital object is not permitted without written permission of the Iowa Women's Archives.","Iowa Women's Archives Founders|Louise Rosenfield Noun Papers, 1926-2002|http://www.lib.uiowa.edu/collguides/?IWA0035|Louise Noun, 1978, 1981, 1999, undated",jpeg,,"Still image|Photographs",IWA0035|https://digital.lib.uiowa.edu/,,,,,,,,,,,,,,,,,,,,,,,,,,,,,,,,,,,,,,,,,,,,,,,,"<a href=""https://digital.lib.uiowa.edu/"" target=""_blank"">View this item in its source respository</a>",,,,,,,,,,,,,,,,,,,,,,,,,,,,,http://www.iowaheritage.org/files/original/6351103283e34e6280cf70eace974296.jpg,"Remote Item","Iowa Women's Archives Founders",1,0
17433,http://www.iowaheritage.org/items/show/17433,"Louise Noun, Des Moines, Iowa, ca. 1998","Women|Noun, Louise R.|United States -- Iowa -- Des Moines|1990-2000|Activists|Art collectors|Authors","""3131 Fleur Drive, Des Moines, Iowa.""",unknown,,"University of Iowa. Libraries. Iowa Women's Archives",1998|2007-09-13,,"Educational use only, no other permissions given. U.S. and international copyright laws may protect this item. Commercial use or distribution of this digital object is not permitted without written permission of the Iowa Women's Archives.","Iowa Women's Archives Founders|Louise Rosenfield Noun Papers, 1926-2002|http://www.lib.uiowa.edu/collguides/?IWA0035|Louise Noun, 1978, 1981, 1999, undated",jpeg,,"Still image|Photographs",IWA0035|https://digital.lib.uiowa.edu/,,,,,,,,,,,,,,,,,,,,,,,,,,,,,,,,,,,,,,,,,,,,,,,,"<a href=""https://digital.lib.uiowa.edu/"" target=""_blank"">View this item in its source respository</a>",,,,,,,,,,,,,,,,,,,,,,,,,,,,,http://www.iowaheritage.org/files/original/1353ffddd3a0c3e3437d1b84284d9db2.jpg,"Remote Item","Iowa Women's Archives Founders",1,0
